{"text_format":"1","workbook":"xlsx","n_sheets":4,"sheets":["scoresheets","schedule","players","Sheet1"],"not_rendered":{"charts":0,"images":0,"macros":1,"external_links":0,"defined_names":6,"comments":0,"pivot_tables":0},"unopened":[],"bounds":{"document_bytes":16777216,"sheet_cells":100000,"rows_first":2000,"rows_last":500,"rows_between":2000,"halvings":0,"cell_chars":16384,"cell_head_chars":4096},"cells_cut":0,"cells_raw":0,"read":"whole","date_system":"1900"}

{"sheet":"scoresheets","index":0,"n_rows":36,"n_cols":13,"rows_kept":36,"cut":false,"hidden":false,"merged":[[5,9,5,10]]}
[]
[null,null,"count",15]
[null,null,"week",6]
[]
[]
[null,null,null,null,15,null,null,{"$f":"\"Week \"&D3","v":"Week 6"},"Date","2010-10-11"]
[]
[null,null,"Team",{"$f":"VLOOKUP(I8,teams,2)","v":"The Owls"},null,null,null,null,{"$f":"VLOOKUP(week,schedule,count+2)","v":2},"Lane",{"$f":"count","v":15},null,15]
[]
[null,null,null,null,"Handicap",1,2,3,"Series Total","Total Handicap","Total","Points"]
[null,null,{"$f":"VLOOKUP(I$8,teams,3)","v":21},{"$f":"VLOOKUP(I$8,teams,4)","v":"Mary Grayson"},{"$f":"VLOOKUP(C11,PLAYERS,3)","v":51},null,null,null,null,{"$f":"+E11*3","v":153}]
[null,null,{"$f":"VLOOKUP(I$8,teams,5)","v":22},{"$f":"VLOOKUP(I$8,teams,6)","v":"Brian Grayson"},{"$f":"VLOOKUP(C12,PLAYERS,3)","v":41},null,null,null,null,{"$f":"+E12*3","v":123}]
[null,null,{"$f":"IF(VLOOKUP(I$8,teams,7)=\"\",\"\",VLOOKUP(I$8,teams,7))","v":""},{"$f":"IF(VLOOKUP(I$8,teams,8)=\"\",\"\",VLOOKUP(I$8,teams,8))","v":""},{"$f":"IF(C13=\"\",\"\",VLOOKUP(C13,PLAYERS,3))","v":""},null,null,null,null,{"$f":"IF(E13=\"\",\"\",+E13*3)","v":""}]
[null,null,{"$f":"IF(VLOOKUP(I$8,teams,9)=\"\",\"\",VLOOKUP(I$8,teams,9))","v":""},{"$f":"IF(VLOOKUP(I$8,teams,10)=\"\",\"\",VLOOKUP(I$8,teams,10))","v":""},{"$f":"IF(C14=\"\",\"\",VLOOKUP(C14,PLAYERS,3))","v":""},null,null,null,null,{"$f":"IF(E14=\"\",\"\",+E14*3)","v":""}]
[null,null,null,"Team Total   ",null,null,null,null,null,{"$f":"IF(J13=\"\",+J11+J12,\"\")","v":276}]
[null,null,null,"Handicap",{"$f":"IF(E13=\"\",E11+E12,\"\")","v":92},{"$f":"E16","v":92},{"$f":"E16","v":92},{"$f":"E16","v":92},{"$f":"IF(F16=\"\",\"\",(F16+G16+H16))","v":276}]
[null,null,null,"Total",null,null,null,null,null,null,null," Total  Points"]
[null,null,null,"Points   "]
[]
[null,null,null,"Splits converted (& other flukes), clean games"]
[null,null,null,"Signed"]
[]
[null,null,"Team",{"$f":"VLOOKUP(I23,teams,2)","v":"The Young Ones"},null,null,null,null,{"$f":"VLOOKUP(week,schedule,count+3)","v":7},"Lane",{"$f":"count+1","v":16}]
[]
[null,null,null,null,"Handicap",1,2,3,"Series Total","Total Handicap","Total","Points"]
[null,null,{"$f":"VLOOKUP(I$23,teams,3)","v":71},{"$f":"VLOOKUP(I$23,teams,4)","v":"Tim Hill"},{"$f":"VLOOKUP(C26,PLAYERS,3)","v":48},null,null,null,null,{"$f":"+E26*3","v":144}]
[null,null,{"$f":"VLOOKUP(I$23,teams,5)","v":72},{"$f":"VLOOKUP(I$23,teams,6)","v":"Adam Holland"},{"$f":"VLOOKUP(C27,PLAYERS,3)","v":51},null,null,null,null,{"$f":"+E27*3","v":153}]
[null,null,{"$f":"IF(VLOOKUP(I$23,teams,7)=\"\",\"\",VLOOKUP(I$23,teams,7))","v":73},{"$f":"IF(VLOOKUP(I$23,teams,8)=\"\",\"\",VLOOKUP(I$23,teams,8))","v":"Nicola Rye Holland"},{"$f":"IF(C28=\"\",\"\",VLOOKUP(C28,PLAYERS,3))","v":30},null,null,null,null,{"$f":"IF(E28=\"\",\"\",+E28*3)","v":90}]
[null,null,{"$f":"IF(VLOOKUP(I$23,teams,9)=\"\",\"\",VLOOKUP(I$23,teams,9))","v":""},{"$f":"IF(VLOOKUP(I$23,teams,10)=\"\",\"\",VLOOKUP(I$23,teams,10))","v":""},{"$f":"IF(C29=\"\",\"\",VLOOKUP(C29,PLAYERS,3))","v":""},null,null,null,null,{"$f":"IF(E29=\"\",\"\",+E29*3)","v":""}]
[null,null,null,"Team Total   ",null,null,null,null,null,{"$f":"IF(J28=\"\",+J26+J27,\"\")","v":""}]
[null,null,null,"Handicap",{"$f":"IF(E28=\"\",E26+E27,\"\")","v":""},{"$f":"E31","v":""},{"$f":"E31","v":""},{"$f":"E31","v":""},{"$f":"IF(F31=\"\",\"\",(F31+G31+H31))","v":""}]
[null,null,null,"Total",null,null,null,null,null,null,null," Total  Points"]
[null,null,null,"Points   "]
[]
[null,null,null,"Splits converted (& other flukes), clean games"]
[null,null,null,"Signed"]

{"sheet":"schedule","index":1,"n_rows":78,"n_cols":23,"rows_kept":78,"cut":false,"hidden":false,"merged":[[4,18,4,19],[4,6,4,7],[4,8,4,9],[4,4,4,5],[4,10,4,11],[4,12,4,13],[4,14,4,15],[4,16,4,17]]}
[]
[null,null,"Monday Night Handicap Doubles League",null,null,null,null,null,null,null,"(as at 7 September)"]
[null,null,"Winter League 2010/11"]
[]
[null,null,null,2010,"1 & 2",null,"3 & 4",null,"5 & 6",null,"7 & 8",null,"9 & 10",null,"11 & 12",null,"13 & 14",null,"15 & 16",null,null,"X-Men","Paul Hurst"]
[null,null,1,"2010-09-13",1,2,3,4,5,6,7,8,9,10,11,12,13,14,15,16,null,"The Owls","Brian Grayson"]
[null,null,2,"2010-09-20",13,12,6,15,8,3,10,5,11,7,9,2,1,16,4,14,null,"Pin Pals","Berenice Davies"]
[null,null,3,"2010-09-27",9,16,8,14,15,10,11,3,5,2,7,13,4,12,1,6,null,"Glitter Girls","Kim Stone"]
[null,null,4,"2010-10-04",7,4,1,10,14,11,15,2,3,13,16,5,6,9,12,8,null,"Dominoes","Alan Barton"]
[null,null,5,"2010-10-11",8,5,2,12,13,1,14,16,15,4,6,3,10,7,9,11,null,"Mac Too +1","Diane MacFarlane"]
[null,null,6,"2010-10-18",10,3,9,13,12,16,4,1,6,14,15,8,5,11,2,7,null,"The Young Ones","Nicola Rye-Holland"]
[null,null,7,"2010-10-25",15,11,7,16,4,9,12,6,8,1,10,14,3,2,13,5,null,"SOS","Dale Cousins"]
[null,null,8,"2010-11-01",6,7,11,1,2,14,8,9,10,12,5,4,15,13,16,3,null,"Hit & Miss","Liz Lake"]
[null,null,9,"2010-11-08",4,13,15,3,11,8,1,14,2,16,12,9,7,5,6,10,null,"Turkeys","Harry Hargreaves"]
[null,null,10,"2010-11-15",12,1,10,8,3,5,2,4,14,9,13,16,11,6,7,15,null,"Duo","Tony Pearce"]
[null,null,11,"2010-11-22",11,10,13,2,16,4,5,15,7,3,8,6,9,1,14,12,null,"Brothers Grimm","Terry Emmony"]
[null,null,12,"2010-11-29",2,6,4,11,9,15,3,12,13,8,14,7,16,10,5,1,null,"Whip & Bake","John Bryer"]
[null,null,13,"2010-12-06",5,9,12,7,6,13,16,11,1,15,4,10,14,3,8,2,null,"RTFB","Gary Wileman"]
[null,null,14,"2010-12-13",14,15,16,6,1,7,13,10,12,5,2,11,8,4,3,9,null,"ICBIN Gutter","Matt Lowe"]
[null,null,null,"2011",null,null,null,null,null,null,null,null,null,null,null,null,null,null,null,null,null,"Lightning Strikes","Terry Highton"]
[null,null,15,"2011-01-10",16,8,14,5,10,2,9,7,4,6,3,1,12,15,11,13]
[null,null,16,"2011-01-17","Position Night"]
[null,null,17,"2011-01-24",4,3,12,11,14,13,16,15,2,1,8,7,10,9,6,5]
[null,null,18,"2011-01-31",15,6,2,9,16,1,14,4,12,13,5,10,7,11,3,8]
[null,null,19,"2011-02-07",14,8,13,7,12,4,6,1,16,9,3,11,2,5,10,15]
[null,null,20,"2011-02-14",10,1,5,16,9,6,8,12,4,7,2,15,13,3,11,14]
[null,null,21,"2011-02-21",12,2,3,6,7,10,11,9,5,8,16,14,4,15,1,13]
[null,null,22,"2011-02-28",13,9,8,15,11,5,7,2,3,10,1,4,14,6,16,12]
[null,null,23,"2011-03-07",16,7,14,10,2,3,5,13,11,15,6,12,1,8,9,4]
[null,null,24,"2011-03-14",1,11,4,5,13,15,3,16,7,6,9,8,12,10,14,2]
[null,null,25,"2011-03-21",3,15,9,12,5,7,10,6,13,4,14,1,16,2,8,11]
[null,null,26,"2011-03-28",8,10,16,13,6,11,15,7,1,12,4,2,9,14,5,3]
[null,null,27,"2011-04-04",2,13,6,8,1,9,12,14,10,11,15,5,3,7,4,16]
[null,null,28,"2011-04-11",11,4,7,14,10,16,1,5,6,2,12,3,8,13,15,9]
[null,null,29,"2011-04-18",7,12,10,4,3,14,2,8,9,5,11,16,15,1,13,6]
[null,null,null,"2011-04-25","Easter Monday"]
[null,null,null,"2011-05-02","May Day"]
[null,null,30,"2011-05-09",6,16,11,2,4,8,9,3,15,14,10,13,5,12,7,1]
[null,null,31,"2011-05-16",5,14,1,3,15,12,13,11,8,16,7,9,6,4,2,10]
[null,null,32,"2011-05-23","Position Night"]
[]
[]
[]
[null,null,null,null,null,null,null,null,null,null,"Tony Pearce"]
[null,null,null,1,"X-Men",null,null,null,"Paul Hurst"]
[null,null,null,2,"The Owls",null,null,null,"Brian Grayson"]
[null,null,null,3,"Pin Pals",null,null,null,"Berenice Davies"]
[null,null,null,4,"Glitter Girls",null,null,null,"Kim Stone"]
[null,null,null,5,"Dominoes",null,null,null,"Alan Barton"]
[null,null,null,6,"Mac Too +1",null,null,null,"Diane MacFarlane"]
[null,null,null,7,"The Young Ones",null,null,null,"Nicola Rye-Holland"]
[null,null,null,8,"SOS",null,null,null,"Dale Cousins"]
[null,null,null,9,"Hit & Miss",null,null,null,"Liz Lake"]
[null,null,null,10,"Turkeys",null,null,null,"Harry Hargreaves"]
[null,null,null,11,"Duo",null,null,null,"Tony Pearce"]
[null,null,null,12,"Brothers Grimm",null,null,null,"Terry Emmony"]
[null,null,null,13,"Whip & Bake",null,null,null,"John Bryer"]
[null,null,null,14,"RTFB",null,null,null,"Gary Wileman"]
[null,null,null,15,"ICBIN Gutter",null,null,null,"Matt Lowe"]
[null,null,null,16,"Lightning Strikes",null,null,null,"Terry Highton"]
[null,null,null,null,null,null,null,null,null,null,null,null,null,null,null,null,11,80]
[null,null,null,null,null,null,null,null,null,null,null,null,null,null,null,null,9,86]
[null,null,null,null,null,null,null,null,null,null,null,null,null,null,null,null,2,88]
[]
[null,null,null,null,11,12,5,6,9,10,1,2,3,4,null,null,6,91]
[null,null,null,null,10,8,12,3,1,7,4,5,6,2,null,null,8,97]
[null,null,27,"2010-04-21",6,7,11,4,8,2,9,3,1,10]
[null,null,28,"2010-04-28",1,3,9,2,11,6,7,12,5,8]
[null,null,null,"2010-05-05","Bank Holiday"]
[null,null,29,"2010-05-12",2,4,1,5,10,12,11,8,9,7]
[null,null,30,"2010-05-19",9,5,3,8,7,4,10,6,11,1]
[null,null,null,"2010-05-26","Bank Holiday"]
[null,null,31,"2010-06-02",3,11,2,10,6,8,5,7,4,12]
[null,null,32,"2010-06-09",8,1,7,11,2,3,12,9,10,5]
[null,null,33,"2010-06-16",7,10,8,12,4,9,6,1,2,11]
[null,null,34,"2010-06-23",12,6,4,1,5,11,3,10,8,9]
[null,null,35,"2010-06-30",5,2,6,9,12,1,8,4,7,3]
[null,null,36,"2010-07-07","Position Night"]

{"sheet":"players","index":2,"n_rows":55,"n_cols":16,"rows_kept":55,"cut":false,"hidden":false,"merged":[]}
[]
[]
[null,null,"players",null,"H'Cap",null,null,"teams"]
[]
[null,null,11,"Paul Hurst",41,null,1,"X-Men",11,"Paul Hurst",{"$f":"I5+1","v":12},"Merv Farrow",{"$f":"K5+1","v":13},"Mick Freeborn",{"$f":"M5+1","v":14},"Lewis Hurst"]
[null,null,12,"Merv Farrow",null,null,2,"The Owls",21,"Mary Grayson",{"$f":"I6+1","v":22},"Brian Grayson"]
[null,null,13,"Mick Freeborn",45,null,3,"Pin Pals",31,"Berenice Davies",32,"Anita Highton",33,"Karen Davies"]
[null,null,14,"Lewis Hurst",null,null,4,"Glitter Girls",41,"Barbara Lewis",42,"Kim Stone",43,"Julie Pinder"]
[null,null,21,"Mary Grayson",51,null,5,"Dominoes",51,"Rose Barton",52,"Alan Barton",53,"Matt Barton",54,"Jason Kettle"]
[null,null,22,"Brian Grayson",41,null,6,"Mac Too +1",61,"Diane MacFarlane",63,"Mick King",62,"Keith MacFarlane"]
[null,null,31,"Berenice Davies",44,null,7,"The Young Ones",71,"Tim Hill",72,"Adam Holland",73,"Nicola Rye Holland"]
[null,null,32,"Anita Highton",46,null,8,"SOS",81,"Dale Cousins",82,"Susi Cousins",83,"Steve Cousins",84,"Chris Cousins"]
[null,null,33,"Karen Davies",57,null,9,"Hit & Miss",91,"Mandy King",92,"Paul Simmons",93,"Liz Lake",94,"Donna Smith"]
[null,null,41,"Barbara Lewis",63,null,10,"Turkeys",101,"Martin Cook",102,"Harry Hargreaves"]
[null,null,42,"Kim Stone",54,null,11,"Duo",111,"Tony Pearce",112,"Richard Lester"]
[null,null,43,"Julie Pinder",57,null,12,"Brothers Grimm",121,"Steve Emmony",122,"Terry Emmony"]
[null,null,51,"Rose Barton",37,null,13,"Whip & Bake",133,"Carrie Bryer",132,"Steve Bryer",131,"John Bryer"]
[null,null,52,"Alan Barton",32,null,14,"RTFB",141,"Gary Wileman",142,"Tony King",143,"Carl Briggs"]
[null,null,53,"Matt Barton",36,null,15,"ICBIN Gutter",151,"Matt Lowe",152,"Rich Tewkesbury",153,"John Glover",154,"Joe McConville"]
[null,null,54,"Jason Kettle",38,null,16,"Lightning Strikes",161,"Mike Davies",162,"Terry Highton",163,"Graham Lewis",164,"Phil Highton"]
[null,null,55,"Max Armitage",26]
[null,null,61,"Diane MacFarlane"]
[null,null,62,"Keith MacFarlane",45]
[null,null,63,"Mick King",27]
[null,null,71,"Tim Hill",48]
[null,null,72,"Adam Holland",51]
[null,null,73,"Nicola Rye Holland",30]
[null,null,81,"Dale Cousins",33]
[null,null,82,"Susi Cousins",56]
[null,null,83,"Steve Cousins",48]
[null,null,84,"Chris Cousins"]
[null,null,91,"Mandy King",75]
[null,null,92,"Paul Simmons",41]
[null,null,93,"Liz Lake",46]
[null,null,94,"Donna Smith",58]
[null,null,101,"Martin Cook",30]
[null,null,102,"Harry Hargreaves",30]
[null,null,111,"Tony Pearce",63]
[null,null,112,"Richard Lester",24]
[null,null,121,"Steve Emmony",28]
[null,null,122,"Terry Emmony",34]
[null,null,131,"John Bryer",31]
[null,null,132,"Steve Bryer"]
[null,null,133,"Carrie Bryer",65]
[null,null,141,"Gary Wileman",38]
[null,null,142,"Tony King",48]
[null,null,143,"Carl Briggs"]
[null,null,151,"Matt Lowe",62]
[null,null,152,"Rich Tewkesbury",56]
[null,null,153,"John Glover"]
[null,null,154,"Joe McConville",69]
[null,null,161,"Mike Davies",75]
[null,null,162,"Terry Highton",41]
[null,null,163,"Graham Lewis",24]
[null,null,164,"Phil Highton"]

{"sheet":"Sheet1","index":3,"n_rows":0,"n_cols":0,"rows_kept":0,"cut":false,"hidden":false,"merged":[]}