{"text_format":"1","workbook":"xlsx","n_sheets":10,"sheets":["schedule","scoresheets","results","players","teams","reports","high scores","Scratch Leagues","Certificates","Sheet2"],"not_rendered":{"charts":0,"images":3,"macros":1,"external_links":0,"defined_names":26,"comments":0,"pivot_tables":0},"unopened":[],"bounds":{"document_bytes":16777216,"sheet_cells":100000,"rows_first":2000,"rows_last":500,"rows_between":2000,"halvings":0,"cell_chars":16384,"cell_head_chars":4096},"cells_cut":0,"cells_raw":0,"read":"whole","date_system":"1900"}

{"sheet":"schedule","index":0,"n_rows":61,"n_cols":14,"rows_kept":61,"cut":false,"hidden":false,"merged":[[4,18,4,19],[4,6,4,7],[4,8,4,9],[4,4,4,5],[4,10,4,11],[4,12,4,13],[4,14,4,15],[4,16,4,17]]}
[]
[null,null,"Monday Night Handicap Doubles League",null,null,null,null,null,null,null,"(as at 23 April 2013)"]
[null,null,"Summer League 2013"]
[]
[null,null,null,null,"1 & 2",null,"3 & 4",null,"5 & 6",null,"7 & 8",null,"9&10"]
[null,null,1,"2013-04-22",1,2,3,4,5,6,7,8,9,10]
[null,null,2,"2013-04-29",7,3,1,6,2,9,8,4,5,10]
[null,null,3,"2013-05-13",4,5,9,8,3,2,6,7,1,10]
[null,null,4,"2013-06-03",9,1,5,3,4,7,8,6,2,10]
[null,null,5,"2013-06-10",10,7,6,2,8,3,4,1,5,9]
[null,null,6,"2013-06-17",5,8,4,10,7,2,6,9,1,3]
[null,null,7,"2013-06-24",6,4,7,9,1,5,10,3,2,8]
[null,null,8,"2013-07-01",3,9,8,1,6,10,2,4,7,5]
[null,null,9,"2013-07-08",8,10,2,5,9,4,1,7,3,6]
[null,null,10,"2013-07-15",4,3,10,9,2,1,6,5,8,7]
[null,null,11,"2013-07-22",6,1,4,8,3,7,9,2,10,5]
[null,null,12,"2013-07-29",8,9,7,6,5,4,1,10,2,3]
[null,null,13,"2013-08-05",3,5,2,10,1,9,7,4,6,8]
[null,null,14,"2013-08-12"]
[null,null,15,"2013-08-19"]
[null,null,16]
[null,null,17]
[null,null,18]
[null,null,19]
[]
[]
[]
[null,null,null,1,"Hot Chris Bunz",null,null,null,"Chris Woodward"]
[null,null,null,2,"Stealth Bowlers",null,null,null,"Carl Briggs",null,null,null,null,"Liz Lake"]
[null,null,null,3,"Chucklers",null,null,null,"Ethan Taylor"]
[null,null,null,4,"Boom",null,null,null,"Lew Ashenden"]
[null,null,null,5,"Duo",null,null,null,"Tony Pearce"]
[null,null,null,6,"Mac Too",null,null,null,"Diane MacFarlane"]
[null,null,null,7,"Brothers Grimm",null,null,null,"Steve Emmony"]
[null,null,null,8,"Hit & Miss",null,null,null,"Liz Lake"]
[null,null,null,9,"Just Friends",null,null,null,"Karen Davies"]
[null,null,null,10,"The Kings",null,null,null,"Kevin King"]
[]
[]
[]
[]
[]
[]
[]
[]
[]
[]
[null,null,null,null,11,12,5,6,9,10,1,2,3,4]
[null,null,null,null,10,8,12,3,1,7,4,5,6,2]
[null,null,27,"2010-04-21",6,7,11,4,8,2,9,3,1,10]
[null,null,28,"2010-04-28",1,3,9,2,11,6,7,12,5,8]
[null,null,null,"2010-05-05","Bank Holiday"]
[null,null,29,"2010-05-12",2,4,1,5,10,12,11,8,9,7]
[null,null,30,"2010-05-19",9,5,3,8,7,4,10,6,11,1]
[null,null,null,"2010-05-26","Bank Holiday"]
[null,null,31,"2010-06-02",3,11,2,10,6,8,5,7,4,12]
[null,null,32,"2010-06-09",8,1,7,11,2,3,12,9,10,5]
[null,null,33,"2010-06-16",7,10,8,12,4,9,6,1,2,11]
[null,null,34,"2010-06-23",12,6,4,1,5,11,3,10,8,9]
[null,null,35,"2010-06-30",5,2,6,9,12,1,8,4,7,3]
[null,null,36,"2010-07-07","Position Night"]

{"sheet":"scoresheets","index":1,"n_rows":36,"n_cols":12,"rows_kept":36,"cut":false,"hidden":false,"merged":[[5,9,5,10]]}
[]
[null,null,"count",9]
[null,null,"week",10]
[null,null,"Date","15 July 2013"]
[]
[null,null,null,"Monday Night Doubles League",null,null,null,{"$f":"\"Week \"&D3","v":"Week 10"},null,{"$f":"D4","v":"15 July 2013"}]
[]
[null,null,"Team",{"$f":"VLOOKUP(I8,teams,2)","v":"Hit & Miss"},null,null,null,null,{"$f":"VLOOKUP(week,schedule,count+2)","v":8},"Lane",{"$f":"count","v":9}]
[]
[null,null,null,null,"Handicap",1,2,3,"Series Total","Total Handicap","Total","Points"]
[null,null,{"$f":"VLOOKUP(I$8,teams,3)","v":81},{"$f":"VLOOKUP(I$8,teams,4)","v":"Paul Simmons"},{"$f":"VLOOKUP(C11,playstats,6)","v":44},null,null,null,null,{"$f":"+E11*3","v":132}]
[null,null,{"$f":"VLOOKUP(I$8,teams,5)","v":82},{"$f":"VLOOKUP(I$8,teams,6)","v":"Liz Lake"},{"$f":"VLOOKUP(C12,playstats,6)","v":51},null,null,null,null,{"$f":"+E12*3","v":153}]
[null,null,{"$f":"IF(VLOOKUP(I$8,teams,7)=\"\",\"\",VLOOKUP(I$8,teams,7))","v":83},{"$f":"IF(VLOOKUP(I$8,teams,8)=\"\",\"\",VLOOKUP(I$8,teams,8))","v":"Donna Smith"},{"$f":"IF(C13=\"\",\"\",VLOOKUP(C13,playstats,6))","v":54},null,null,null,null,{"$f":"IF(E13=\"\",\"\",+E13*3)","v":162}]
[null,null,{"$f":"IF(VLOOKUP(I$8,teams,9)=\"\",\"\",VLOOKUP(I$8,teams,9))","v":""},{"$f":"IF(VLOOKUP(I$8,teams,10)=\"\",\"\",VLOOKUP(I$8,teams,10))","v":""},{"$f":"IF(C14=\"\",\"\",VLOOKUP(C14,PLAYERS,3))","v":""},null,null,null,null,{"$f":"IF(E14=\"\",\"\",+E14*3)","v":""}]
[null,null,null,"Team Total   ",null,null,null,null,null,{"$f":"IF(J13=\"\",+J11+J12,\"\")","v":""}]
[null,null,null,"Handicap",{"$f":"IF(E13=\"\",E11+E12,\"\")","v":""},{"$f":"E16","v":""},{"$f":"E16","v":""},{"$f":"E16","v":""},{"$f":"IF(F16=\"\",\"\",(F16+G16+H16))","v":""}]
[null,null,null,"Total",null,null,null,null,null,null,null," Total  Points"]
[null,null,null,"Points   "]
[]
[null,null,null,"Splits converted (& other flukes), clean games"]
[null,null,null,"Signed"]
[]
[null,null,"Team",{"$f":"VLOOKUP(I23,teams,2)","v":"Brothers Grimm"},null,null,null,null,{"$f":"VLOOKUP(week,schedule,count+3)","v":7},"Lane",{"$f":"count+1","v":10}]
[]
[null,null,null,null,"Handicap",1,2,3,"Series Total","Total Handicap","Total","Points"]
[null,null,{"$f":"VLOOKUP(I$23,teams,3)","v":71},{"$f":"VLOOKUP(I$23,teams,4)","v":"Steve Emmony"},{"$f":"VLOOKUP(C26,playstats,6)","v":28},null,null,null,null,{"$f":"+E26*3","v":84}]
[null,null,{"$f":"VLOOKUP(I$23,teams,5)","v":72},{"$f":"VLOOKUP(I$23,teams,6)","v":"Terry Emmony"},{"$f":"VLOOKUP(C27,playstats,6)","v":38},null,null,null,null,{"$f":"+E27*3","v":114}]
[null,null,{"$f":"IF(VLOOKUP(I$23,teams,7)=\"\",\"\",VLOOKUP(I$23,teams,7))","v":73},{"$f":"IF(VLOOKUP(I$23,teams,8)=\"\",\"\",VLOOKUP(I$23,teams,8))","v":"Martin Cook"},{"$f":"IF(C28=\"\",\"\",VLOOKUP(C28,playstats,6))","v":42},null,null,null,null,{"$f":"IF(E28=\"\",\"\",+E28*3)","v":126}]
[null,null,{"$f":"IF(VLOOKUP(I$23,teams,9)=\"\",\"\",VLOOKUP(I$23,teams,9))","v":""},{"$f":"IF(VLOOKUP(I$23,teams,10)=\"\",\"\",VLOOKUP(I$23,teams,10))","v":""},{"$f":"IF(C29=\"\",\"\",VLOOKUP(C29,PLAYERS,3))","v":""},null,null,null,null,{"$f":"IF(E29=\"\",\"\",+E29*3)","v":""}]
[null,null,null,"Team Total   ",null,null,null,null,null,{"$f":"IF(J28=\"\",+J26+J27,\"\")","v":""}]
[null,null,null,"Handicap",{"$f":"IF(E28=\"\",E26+E27,\"\")","v":""},{"$f":"E31","v":""},{"$f":"E31","v":""},{"$f":"E31","v":""},{"$f":"IF(F31=\"\",\"\",(F31+G31+H31))","v":""}]
[null,null,null,"Total",null,null,null,null,null,null,null," Total  Points"]
[null,null,null,"Points   "]
[]
[null,null,null,"Splits converted (& other flukes), clean games"]
[null,null,null,"Signed"]

{"sheet":"results","index":2,"n_rows":121,"n_cols":20,"rows_kept":121,"cut":false,"hidden":false,"merged":[[3,30,3,31],[3,32,3,33],[3,25,3,26],[3,22,3,23]]}
[]
[null,null,null,"scoresheets","week",10,{"$f":"VLOOKUP(F2,schedule,2)","v":"2013-07-15"}]
[null,"Team",null,null,null,1,2,3,"Series","Hcap","Total","Pts"]
[1,4,41,{"$f":"VLOOKUP(C4,playstats,2)","v":"Lew Ashenden"},{"$f":"VLOOKUP(C4,playstats,6)","v":53},76,115,204,{"$f":"SUM(F4:H4)","v":395},{"$f":"E4*3","v":159},{"$f":"I4+J4","v":554},{"$f":"2-L11","v":0},null,null,"Results"]
[null,null,42,{"$f":"VLOOKUP(C5,playstats,2)","v":"Chris Johnson"},{"$f":"VLOOKUP(C5,playstats,6)","v":49},94,139,123,{"$f":"SUM(F5:H5)","v":356},{"$f":"E5*3","v":147},{"$f":"I5+J5","v":503},{"$f":"2-L12","v":2},null,1,{"$f":"VLOOKUP(B4,teams,2)","v":"Boom"},{"$f":"I8","v":1057},{"$f":"L9","v":8},{"$f":"VLOOKUP(B11,teams,2)","v":"Chucklers"},{"$f":"L16","v":4},{"$f":"I15","v":1047}]
[null,null,null,null,null,{"$f":"SUM(F4:F5)","v":170},{"$f":"SUM(G4:G5)","v":254},{"$f":"SUM(H4:H5)","v":327},{"$f":"SUM(I4:I5)","v":751},null,null,null,null,2,{"$f":"VLOOKUP(B19,teams,2)","v":"The Kings"},{"$f":"I23","v":1141},{"$f":"L24","v":2},{"$f":"VLOOKUP(B26,teams,2)","v":"Just Friends"},{"$f":"L31","v":10},{"$f":"I30","v":1284}]
[null,null,null,null,null,{"$f":"$E4+$E5","v":102},{"$f":"$E4+$E5","v":102},{"$f":"$E4+$E5","v":102},{"$f":"SUM(F7:H7)","v":306},{"$f":"SUM(J4:J5)","v":306},{"$f":"SUM(K4:K5)","v":1057},null,null,3,{"$f":"VLOOKUP(B34,teams,2)","v":"Mac Too"},{"$f":"I38","v":1057},{"$f":"L39","v":8},{"$f":"VLOOKUP(B41,teams,2)","v":"Duo"},{"$f":"L46","v":4},{"$f":"I45","v":1041}]
[null,null,null,null,null,{"$f":"SUM(F6:F7)","v":272},{"$f":"SUM(G6:G7)","v":356},{"$f":"SUM(H6:H7)","v":429},{"$f":"SUM(I6:I7)","v":1057},null,null,null,null,4,{"$f":"VLOOKUP(B49,teams,2)","v":"Hit & Miss"},{"$f":"I53","v":1148},{"$f":"L54","v":8},{"$f":"VLOOKUP(B56,teams,2)","v":"Brothers Grimm"},{"$f":"L61","v":4},{"$f":"I60","v":1071}]
[null,null,null,null,null,{"$f":"2-F16","v":0},{"$f":"2-G16","v":2},{"$f":"2-H16","v":2},{"$f":"2-I16","v":2},null,null,{"$f":"SUM(L4:L8)+SUM(F9:I9)","v":8},null,5,{"$f":"VLOOKUP(B64,teams,2)","v":"Stealth Bowlers"},{"$f":"I68","v":204},{"$f":"L69","v":0},{"$f":"VLOOKUP(B71,teams,2)","v":"The Kings"},{"$f":"L76","v":12},{"$f":"I75","v":273}]
[null,null,null,null,null,null,null,null,null,null,null,null,null,6,{"$f":"VLOOKUP(B79,teams,2)","v":"Just Friends"},{"$f":"I83","v":300},{"$f":"L84","v":12},{"$f":"VLOOKUP(B86,teams,2)","v":"The Kings"},{"$f":"L91","v":0},{"$f":"I90","v":273}]
[null,3,31,{"$f":"VLOOKUP(C11,playstats,2)","v":"Sarah Shellard"},{"$f":"VLOOKUP(C11,playstats,6)","v":49},156,145,127,{"$f":"SUM(F11:H11)","v":428},{"$f":"E11*3","v":147},{"$f":"I11+J11","v":575},{"$f":"IF(K11>K4,2,IF(K11=K4,1,0))","v":2},null,7,{"$f":"VLOOKUP(B94,teams,2)","v":"Duo"},{"$f":"I98","v":240},{"$f":"L99","v":2},{"$f":"VLOOKUP(B101,teams,2)","v":"The Kings"},{"$f":"L106","v":10},{"$f":"I105","v":273}]
[null,null,33,{"$f":"VLOOKUP(C12,playstats,2)","v":"Owen Campbell"},{"$f":"VLOOKUP(C12,playstats,6)","v":50},135,90,97,{"$f":"SUM(F12:H12)","v":322},{"$f":"E12*3","v":150},{"$f":"I12+J12","v":472},{"$f":"IF(K12>K5,2,IF(K12=K5,1,0))","v":0},null,8,{"$f":"VLOOKUP(B109,teams,2)","v":"Hot Chris Bunz"},{"$f":"I113","v":243},{"$f":"L114","v":0},{"$f":"VLOOKUP(B116,teams,2)","v":"The Kings"},{"$f":"L121","v":12},{"$f":"I120","v":273}]
[null,null,null,null,null,{"$f":"SUM(F11:F12)","v":291},{"$f":"SUM(G11:G12)","v":235},{"$f":"SUM(H11:H12)","v":224},{"$f":"SUM(I11:I12)","v":750}]
[null,null,null,null,null,{"$f":"$E11+$E12","v":99},{"$f":"$E11+$E12","v":99},{"$f":"$E11+$E12","v":99},{"$f":"SUM(F14:H14)","v":297},{"$f":"SUM(J11:J12)","v":297},{"$f":"SUM(K11:K12)","v":1047}]
[null,null,null,null,null,{"$f":"SUM(F13:F14)","v":390},{"$f":"SUM(G13:G14)","v":334},{"$f":"SUM(H13:H14)","v":323},{"$f":"SUM(I13:I14)","v":1047}]
[null,null,null,null,null,{"$f":"IF(F15>F8,2,IF(F15=F8,1,0))","v":2},{"$f":"IF(G15>G8,2,IF(G15=G8,1,0))","v":0},{"$f":"IF(H15>H8,2,IF(H15=H8,1,0))","v":0},{"$f":"IF(I15>I8,2,IF(I15=I8,1,0))","v":0},null,null,{"$f":"SUM(L11:L15)+SUM(F16:I16)","v":4}]
[]
[]
[2,10,102,{"$f":"VLOOKUP(C19,playstats,2)","v":"Karl King"},{"$f":"VLOOKUP(C19,playstats,6)","v":42},110,143,200,{"$f":"SUM(F19:H19)","v":453},{"$f":"E19*3","v":126},{"$f":"I19+J19","v":579},{"$f":"2-L26","v":0}]
[null,null,101,{"$f":"VLOOKUP(C20,playstats,2)","v":"Kevin King"},{"$f":"VLOOKUP(C20,playstats,6)","v":49},129,107,179,{"$f":"SUM(F20:H20)","v":415},{"$f":"E20*3","v":147},{"$f":"I20+J20","v":562},{"$f":"2-L27","v":0}]
[null,null,null,null,null,{"$f":"SUM(F19:F20)","v":239},{"$f":"SUM(G19:G20)","v":250},{"$f":"SUM(H19:H20)","v":379},{"$f":"SUM(I19:I20)","v":868}]
[null,null,null,null,null,{"$f":"$E19+$E20","v":91},{"$f":"$E19+$E20","v":91},{"$f":"$E19+$E20","v":91},{"$f":"SUM(F22:H22)","v":273},{"$f":"SUM(J19:J20)","v":273},{"$f":"SUM(K19:K20)","v":1141}]
[null,null,null,null,null,{"$f":"SUM(F21:F22)","v":330},{"$f":"SUM(G21:G22)","v":341},{"$f":"SUM(H21:H22)","v":470},{"$f":"SUM(I21:I22)","v":1141}]
[null,null,null,null,null,{"$f":"2-F31","v":0},{"$f":"2-G31","v":0},{"$f":"2-H31","v":2},{"$f":"2-I31","v":0},null,null,{"$f":"SUM(L19:L23)+SUM(F24:I24)","v":2}]
[]
[null,9,92,{"$f":"VLOOKUP(C26,playstats,2)","v":"Martin Lapidge"},{"$f":"VLOOKUP(C26,playstats,6)","v":43},192,148,179,{"$f":"SUM(F26:H26)","v":519},{"$f":"E26*3","v":129},{"$f":"I26+J26","v":648},{"$f":"IF(K26>K19,2,IF(K26=K19,1,0))","v":2}]
[null,null,93,{"$f":"VLOOKUP(C27,playstats,2)","v":"Terry Highton"},{"$f":"VLOOKUP(C27,playstats,6)","v":31},166,198,179,{"$f":"SUM(F27:H27)","v":543},{"$f":"E27*3","v":93},{"$f":"I27+J27","v":636},{"$f":"IF(K27>K20,2,IF(K27=K20,1,0))","v":2}]
[null,null,null,null,null,{"$f":"SUM(F26:F27)","v":358},{"$f":"SUM(G26:G27)","v":346},{"$f":"SUM(H26:H27)","v":358},{"$f":"SUM(I26:I27)","v":1062}]
[null,null,null,null,null,{"$f":"$E26+$E27","v":74},{"$f":"$E26+$E27","v":74},{"$f":"$E26+$E27","v":74},{"$f":"SUM(F29:H29)","v":222},{"$f":"SUM(J26:J27)","v":222},{"$f":"SUM(K26:K27)","v":1284}]
[null,null,null,null,null,{"$f":"SUM(F28:F29)","v":432},{"$f":"SUM(G28:G29)","v":420},{"$f":"SUM(H28:H29)","v":432},{"$f":"SUM(I28:I29)","v":1284}]
[null,null,null,null,null,{"$f":"IF(F30>F23,2,IF(F30=F23,1,0))","v":2},{"$f":"IF(G30>G23,2,IF(G30=G23,1,0))","v":2},{"$f":"IF(H30>H23,2,IF(H30=H23,1,0))","v":0},{"$f":"IF(I30>I23,2,IF(I30=I23,1,0))","v":2},null,null,{"$f":"SUM(L26:L30)+SUM(F31:I31)","v":10}]
[]
[]
[3,6,61,{"$f":"VLOOKUP(C34,playstats,2)","v":"Diane MacFarlane"},{"$f":"VLOOKUP(C34,playstats,6)","v":41},144,134,134,{"$f":"SUM(F34:H34)","v":412},{"$f":"E34*3","v":123},{"$f":"I34+J34","v":535},{"$f":"2-L41","v":0}]
[null,null,62,{"$f":"VLOOKUP(C35,playstats,2)","v":"Keith MacFarlane"},{"$f":"VLOOKUP(C35,playstats,6)","v":30},175,122,135,{"$f":"SUM(F35:H35)","v":432},{"$f":"E35*3","v":90},{"$f":"I35+J35","v":522},{"$f":"2-L42","v":2}]
[null,null,null,null,null,{"$f":"SUM(F34:F35)","v":319},{"$f":"SUM(G34:G35)","v":256},{"$f":"SUM(H34:H35)","v":269},{"$f":"SUM(I34:I35)","v":844}]
[null,null,null,null,null,{"$f":"$E34+$E35","v":71},{"$f":"$E34+$E35","v":71},{"$f":"$E34+$E35","v":71},{"$f":"SUM(F37:H37)","v":213},{"$f":"SUM(J34:J35)","v":213},{"$f":"SUM(K34:K35)","v":1057}]
[null,null,null,null,null,{"$f":"SUM(F36:F37)","v":390},{"$f":"SUM(G36:G37)","v":327},{"$f":"SUM(H36:H37)","v":340},{"$f":"SUM(I36:I37)","v":1057}]
[null,null,null,null,null,{"$f":"2-F46","v":2},{"$f":"2-G46","v":2},{"$f":"2-H46","v":0},{"$f":"2-I46","v":2},null,null,{"$f":"SUM(L34:L38)+SUM(F39:I39)","v":8}]
[]
[null,5,51,{"$f":"VLOOKUP(C41,playstats,2)","v":"Tony Pearce"},{"$f":"VLOOKUP(C41,playstats,6)","v":51},164,99,151,{"$f":"SUM(F41:H41)","v":414},{"$f":"E41*3","v":153},{"$f":"I41+J41","v":567},{"$f":"IF(K41>K34,2,IF(K41=K34,1,0))","v":2}]
[null,null,52,{"$f":"VLOOKUP(C42,playstats,2)","v":"Richard Lester"},{"$f":"VLOOKUP(C42,playstats,6)","v":29},129,129,129,{"$f":"SUM(F42:H42)","v":387},{"$f":"E42*3","v":87},{"$f":"I42+J42","v":474},{"$f":"IF(K42>K35,2,IF(K42=K35,1,0))","v":0}]
[null,null,null,null,null,{"$f":"SUM(F41:F42)","v":293},{"$f":"SUM(G41:G42)","v":228},{"$f":"SUM(H41:H42)","v":280},{"$f":"SUM(I41:I42)","v":801}]
[null,null,null,null,null,{"$f":"$E41+$E42","v":80},{"$f":"$E41+$E42","v":80},{"$f":"$E41+$E42","v":80},{"$f":"SUM(F44:H44)","v":240},{"$f":"SUM(J41:J42)","v":240},{"$f":"SUM(K41:K42)","v":1041}]
[null,null,null,null,null,{"$f":"SUM(F43:F44)","v":373},{"$f":"SUM(G43:G44)","v":308},{"$f":"SUM(H43:H44)","v":360},{"$f":"SUM(I43:I44)","v":1041}]
[null,null,null,null,null,{"$f":"IF(F45>F38,2,IF(F45=F38,1,0))","v":0},{"$f":"IF(G45>G38,2,IF(G45=G38,1,0))","v":0},{"$f":"IF(H45>H38,2,IF(H45=H38,1,0))","v":2},{"$f":"IF(I45>I38,2,IF(I45=I38,1,0))","v":0},null,null,{"$f":"SUM(L41:L45)+SUM(F46:I46)","v":4}]
[]
[]
[4,8,81,{"$f":"VLOOKUP(C49,playstats,2)","v":"Paul Simmons"},{"$f":"VLOOKUP(C49,playstats,6)","v":44},152,158,159,{"$f":"SUM(F49:H49)","v":469},{"$f":"E49*3","v":132},{"$f":"I49+J49","v":601},{"$f":"2-L56","v":2}]
[null,null,82,{"$f":"VLOOKUP(C50,playstats,2)","v":"Liz Lake"},{"$f":"VLOOKUP(C50,playstats,6)","v":51},140,111,143,{"$f":"SUM(F50:H50)","v":394},{"$f":"E50*3","v":153},{"$f":"I50+J50","v":547},{"$f":"2-L57","v":0}]
[null,null,null,null,null,{"$f":"SUM(F49:F50)","v":292},{"$f":"SUM(G49:G50)","v":269},{"$f":"SUM(H49:H50)","v":302},{"$f":"SUM(I49:I50)","v":863}]
[null,null,null,null,null,{"$f":"$E49+$E50","v":95},{"$f":"$E49+$E50","v":95},{"$f":"$E49+$E50","v":95},{"$f":"SUM(F52:H52)","v":285},{"$f":"SUM(J49:J50)","v":285},{"$f":"SUM(K49:K50)","v":1148}]
[null,null,null,null,null,{"$f":"SUM(F51:F52)","v":387},{"$f":"SUM(G51:G52)","v":364},{"$f":"SUM(H51:H52)","v":397},{"$f":"SUM(I51:I52)","v":1148}]
[null,null,null,null,null,{"$f":"2-F61","v":2},{"$f":"2-G61","v":0},{"$f":"2-H61","v":2},{"$f":"2-I61","v":2},null,null,{"$f":"SUM(L49:L53)+SUM(F54:I54)","v":8}]
[]
[null,7,71,{"$f":"VLOOKUP(C56,playstats,2)","v":"Steve Emmony"},{"$f":"VLOOKUP(C56,playstats,6)","v":28},126,149,146,{"$f":"SUM(F56:H56)","v":421},{"$f":"E56*3","v":84},{"$f":"I56+J56","v":505},{"$f":"IF(K56>K49,2,IF(K56=K49,1,0))","v":0}]
[null,null,72,{"$f":"VLOOKUP(C57,playstats,2)","v":"Terry Emmony"},{"$f":"VLOOKUP(C57,playstats,6)","v":38},131,179,142,{"$f":"SUM(F57:H57)","v":452},{"$f":"E57*3","v":114},{"$f":"I57+J57","v":566},{"$f":"IF(K57>K50,2,IF(K57=K50,1,0))","v":2}]
[null,null,null,null,null,{"$f":"SUM(F56:F57)","v":257},{"$f":"SUM(G56:G57)","v":328},{"$f":"SUM(H56:H57)","v":288},{"$f":"SUM(I56:I57)","v":873}]
[null,null,null,null,null,{"$f":"$E56+$E57","v":66},{"$f":"$E56+$E57","v":66},{"$f":"$E56+$E57","v":66},{"$f":"SUM(F59:H59)","v":198},{"$f":"SUM(J56:J57)","v":198},{"$f":"SUM(K56:K57)","v":1071}]
[null,null,null,null,null,{"$f":"SUM(F58:F59)","v":323},{"$f":"SUM(G58:G59)","v":394},{"$f":"SUM(H58:H59)","v":354},{"$f":"SUM(I58:I59)","v":1071}]
[null,null,null,null,null,{"$f":"IF(F60>F53,2,IF(F60=F53,1,0))","v":0},{"$f":"IF(G60>G53,2,IF(G60=G53,1,0))","v":2},{"$f":"IF(H60>H53,2,IF(H60=H53,1,0))","v":0},{"$f":"IF(I60>I53,2,IF(I60=I53,1,0))","v":0},null,null,{"$f":"SUM(L56:L60)+SUM(F61:I61)","v":4}]
[]
[]
[5,2,21,{"$f":"VLOOKUP(C64,playstats,2)","v":"Carl Briggs"},{"$f":"VLOOKUP(C64,playstats,6)","v":34},null,null,null,null,{"$f":"E64*3","v":102},{"$f":"I64+J64","v":102},{"$f":"2-L71","v":0}]
[null,null,23,{"$f":"VLOOKUP(C65,playstats,2)","v":"Nathon Ferrie"},{"$f":"VLOOKUP(C65,playstats,6)","v":34},null,null,null,null,{"$f":"E65*3","v":102},{"$f":"I65+J65","v":102},{"$f":"2-L72","v":0}]
[null,null,null,null,null,{"$f":"SUM(F64:F65)","v":0},{"$f":"SUM(G64:G65)","v":0},{"$f":"SUM(H64:H65)","v":0},{"$f":"SUM(I64:I65)","v":0}]
[null,null,null,null,null,{"$f":"$E64+$E65","v":68},{"$f":"$E64+$E65","v":68},{"$f":"$E64+$E65","v":68},{"$f":"SUM(F67:H67)","v":204},{"$f":"SUM(J64:J65)","v":204},{"$f":"SUM(K64:K65)","v":204}]
[null,null,null,null,null,{"$f":"SUM(F66:F67)","v":68},{"$f":"SUM(G66:G67)","v":68},{"$f":"SUM(H66:H67)","v":68},{"$f":"SUM(I66:I67)","v":204}]
[null,null,null,null,null,{"$f":"2-F76","v":0},{"$f":"2-G76","v":0},{"$f":"2-H76","v":0},{"$f":"2-I76","v":0},null,null,{"$f":"SUM(L64:L68)+SUM(F69:I69)","v":0}]
[]
[null,10,102,{"$f":"VLOOKUP(C71,playstats,2)","v":"Karl King"},{"$f":"VLOOKUP(C71,playstats,6)","v":42},null,null,null,null,{"$f":"E71*3","v":126},{"$f":"I71+J71","v":126},{"$f":"IF(K71>K64,2,IF(K71=K64,1,0))","v":2}]
[null,null,101,{"$f":"VLOOKUP(C72,playstats,2)","v":"Kevin King"},{"$f":"VLOOKUP(C72,playstats,6)","v":49},null,null,null,null,{"$f":"E72*3","v":147},{"$f":"I72+J72","v":147},{"$f":"IF(K72>K65,2,IF(K72=K65,1,0))","v":2}]
[null,null,null,null,null,{"$f":"SUM(F71:F72)","v":0},{"$f":"SUM(G71:G72)","v":0},{"$f":"SUM(H71:H72)","v":0},{"$f":"SUM(I71:I72)","v":0}]
[null,null,null,null,null,{"$f":"$E71+$E72","v":91},{"$f":"$E71+$E72","v":91},{"$f":"$E71+$E72","v":91},{"$f":"SUM(F74:H74)","v":273},{"$f":"SUM(J71:J72)","v":273},{"$f":"SUM(K71:K72)","v":273}]
[null,null,null,null,null,{"$f":"SUM(F73:F74)","v":91},{"$f":"SUM(G73:G74)","v":91},{"$f":"SUM(H73:H74)","v":91},{"$f":"SUM(I73:I74)","v":273}]
[null,null,null,null,null,{"$f":"IF(F75>F68,2,IF(F75=F68,1,0))","v":2},{"$f":"IF(G75>G68,2,IF(G75=G68,1,0))","v":2},{"$f":"IF(H75>H68,2,IF(H75=H68,1,0))","v":2},{"$f":"IF(I75>I68,2,IF(I75=I68,1,0))","v":2},null,null,{"$f":"SUM(L71:L75)+SUM(F76:I76)","v":12}]
[]
[]
[6,9,92,{"$f":"VLOOKUP(C79,playstats,2)","v":"Martin Lapidge"},{"$f":"VLOOKUP(C79,playstats,6)","v":43},null,null,null,null,{"$f":"E79*3","v":129},{"$f":"I79+J79","v":129},{"$f":"2-L86","v":2}]
[null,null,91,{"$f":"VLOOKUP(C80,playstats,2)","v":"Karen Davies"},{"$f":"VLOOKUP(C80,playstats,6)","v":57},null,null,null,null,{"$f":"E80*3","v":171},{"$f":"I80+J80","v":171},{"$f":"2-L87","v":2}]
[null,null,null,null,null,{"$f":"SUM(F79:F80)","v":0},{"$f":"SUM(G79:G80)","v":0},{"$f":"SUM(H79:H80)","v":0},{"$f":"SUM(I79:I80)","v":0}]
[null,null,null,null,null,{"$f":"$E79+$E80","v":100},{"$f":"$E79+$E80","v":100},{"$f":"$E79+$E80","v":100},{"$f":"SUM(F82:H82)","v":300},{"$f":"SUM(J79:J80)","v":300},{"$f":"SUM(K79:K80)","v":300}]
[null,null,null,null,null,{"$f":"SUM(F81:F82)","v":100},{"$f":"SUM(G81:G82)","v":100},{"$f":"SUM(H81:H82)","v":100},{"$f":"SUM(I81:I82)","v":300}]
[null,null,null,null,null,{"$f":"2-F91","v":2},{"$f":"2-G91","v":2},{"$f":"2-H91","v":2},{"$f":"2-I91","v":2},null,null,{"$f":"SUM(L79:L83)+SUM(F84:I84)","v":12}]
[]
[null,10,102,{"$f":"VLOOKUP(C86,playstats,2)","v":"Karl King"},{"$f":"VLOOKUP(C86,playstats,6)","v":42},null,null,null,null,{"$f":"E86*3","v":126},{"$f":"I86+J86","v":126},{"$f":"IF(K86>K79,2,IF(K86=K79,1,0))","v":0}]
[null,null,101,{"$f":"VLOOKUP(C87,playstats,2)","v":"Kevin King"},{"$f":"VLOOKUP(C87,playstats,6)","v":49},null,null,null,null,{"$f":"E87*3","v":147},{"$f":"I87+J87","v":147},{"$f":"IF(K87>K80,2,IF(K87=K80,1,0))","v":0}]
[null,null,null,null,null,{"$f":"SUM(F86:F87)","v":0},{"$f":"SUM(G86:G87)","v":0},{"$f":"SUM(H86:H87)","v":0},{"$f":"SUM(I86:I87)","v":0}]
[null,null,null,null,null,{"$f":"$E86+$E87","v":91},{"$f":"$E86+$E87","v":91},{"$f":"$E86+$E87","v":91},{"$f":"SUM(F89:H89)","v":273},{"$f":"SUM(J86:J87)","v":273},{"$f":"SUM(K86:K87)","v":273}]
[null,null,null,null,null,{"$f":"SUM(F88:F89)","v":91},{"$f":"SUM(G88:G89)","v":91},{"$f":"SUM(H88:H89)","v":91},{"$f":"SUM(I88:I89)","v":273}]
[null,null,null,null,null,{"$f":"IF(F90>F83,2,IF(F90=F83,1,0))","v":0},{"$f":"IF(G90>G83,2,IF(G90=G83,1,0))","v":0},{"$f":"IF(H90>H83,2,IF(H90=H83,1,0))","v":0},{"$f":"IF(I90>I83,2,IF(I90=I83,1,0))","v":0},null,null,{"$f":"SUM(L86:L90)+SUM(F91:I91)","v":0}]
[]
[]
[7,5,51,{"$f":"VLOOKUP(C94,playstats,2)","v":"Tony Pearce"},{"$f":"VLOOKUP(C94,playstats,6)","v":51},null,null,null,null,{"$f":"E94*3","v":153},{"$f":"I94+J94","v":153},{"$f":"2-L101","v":2}]
[null,null,52,{"$f":"VLOOKUP(C95,playstats,2)","v":"Richard Lester"},{"$f":"VLOOKUP(C95,playstats,6)","v":29},null,null,null,null,{"$f":"E95*3","v":87},{"$f":"I95+J95","v":87},{"$f":"2-L102","v":0}]
[null,null,null,null,null,{"$f":"SUM(F94:F95)","v":0},{"$f":"SUM(G94:G95)","v":0},{"$f":"SUM(H94:H95)","v":0},{"$f":"SUM(I94:I95)","v":0}]
[null,null,null,null,null,{"$f":"$E94+$E95","v":80},{"$f":"$E94+$E95","v":80},{"$f":"$E94+$E95","v":80},{"$f":"SUM(F97:H97)","v":240},{"$f":"SUM(J94:J95)","v":240},{"$f":"SUM(K94:K95)","v":240}]
[null,null,null,null,null,{"$f":"SUM(F96:F97)","v":80},{"$f":"SUM(G96:G97)","v":80},{"$f":"SUM(H96:H97)","v":80},{"$f":"SUM(I96:I97)","v":240}]
[null,null,null,null,null,{"$f":"2-F106","v":0},{"$f":"2-G106","v":0},{"$f":"2-H106","v":0},{"$f":"2-I106","v":0},null,null,{"$f":"SUM(L94:L98)+SUM(F99:I99)","v":2}]
[]
[null,10,102,{"$f":"VLOOKUP(C101,playstats,2)","v":"Karl King"},{"$f":"VLOOKUP(C101,playstats,6)","v":42},null,null,null,null,{"$f":"E101*3","v":126},{"$f":"I101+J101","v":126},{"$f":"IF(K101>K94,2,IF(K101=K94,1,0))","v":0}]
[null,null,101,{"$f":"VLOOKUP(C102,playstats,2)","v":"Kevin King"},{"$f":"VLOOKUP(C102,playstats,6)","v":49},null,null,null,null,{"$f":"E102*3","v":147},{"$f":"I102+J102","v":147},{"$f":"IF(K102>K95,2,IF(K102=K95,1,0))","v":2}]
[null,null,null,null,null,{"$f":"SUM(F101:F102)","v":0},{"$f":"SUM(G101:G102)","v":0},{"$f":"SUM(H101:H102)","v":0},{"$f":"SUM(I101:I102)","v":0}]
[null,null,null,null,null,{"$f":"$E101+$E102","v":91},{"$f":"$E101+$E102","v":91},{"$f":"$E101+$E102","v":91},{"$f":"SUM(F104:H104)","v":273},{"$f":"SUM(J101:J102)","v":273},{"$f":"SUM(K101:K102)","v":273}]
[null,null,null,null,null,{"$f":"SUM(F103:F104)","v":91},{"$f":"SUM(G103:G104)","v":91},{"$f":"SUM(H103:H104)","v":91},{"$f":"SUM(I103:I104)","v":273}]
[null,null,null,null,null,{"$f":"IF(F105>F98,2,IF(F105=F98,1,0))","v":2},{"$f":"IF(G105>G98,2,IF(G105=G98,1,0))","v":2},{"$f":"IF(H105>H98,2,IF(H105=H98,1,0))","v":2},{"$f":"IF(I105>I98,2,IF(I105=I98,1,0))","v":2},null,null,{"$f":"SUM(L101:L105)+SUM(F106:I106)","v":10}]
[]
[]
[8,1,11,{"$f":"VLOOKUP(C109,playstats,2)","v":"Chris Woodward"},{"$f":"VLOOKUP(C109,playstats,6)","v":38},null,null,null,null,{"$f":"E109*3","v":114},{"$f":"I109+J109","v":114},{"$f":"2-L116","v":0}]
[null,null,12,{"$f":"VLOOKUP(C110,playstats,2)","v":"Bunz Hughes"},{"$f":"VLOOKUP(C110,playstats,6)","v":43},null,null,null,null,{"$f":"E110*3","v":129},{"$f":"I110+J110","v":129},{"$f":"2-L117","v":0}]
[null,null,null,null,null,{"$f":"SUM(F109:F110)","v":0},{"$f":"SUM(G109:G110)","v":0},{"$f":"SUM(H109:H110)","v":0},{"$f":"SUM(I109:I110)","v":0}]
[null,null,null,null,null,{"$f":"$E109+$E110","v":81},{"$f":"$E109+$E110","v":81},{"$f":"$E109+$E110","v":81},{"$f":"SUM(F112:H112)","v":243},{"$f":"SUM(J109:J110)","v":243},{"$f":"SUM(K109:K110)","v":243}]
[null,null,null,null,null,{"$f":"SUM(F111:F112)","v":81},{"$f":"SUM(G111:G112)","v":81},{"$f":"SUM(H111:H112)","v":81},{"$f":"SUM(I111:I112)","v":243}]
[null,null,null,null,null,{"$f":"2-F121","v":0},{"$f":"2-G121","v":0},{"$f":"2-H121","v":0},{"$f":"2-I121","v":0},null,null,{"$f":"SUM(L109:L113)+SUM(F114:I114)","v":0}]
[]
[null,10,102,{"$f":"VLOOKUP(C116,playstats,2)","v":"Karl King"},{"$f":"VLOOKUP(C116,playstats,6)","v":42},null,null,null,null,{"$f":"E116*3","v":126},{"$f":"I116+J116","v":126},{"$f":"IF(K116>K109,2,IF(K116=K109,1,0))","v":2}]
[null,null,101,{"$f":"VLOOKUP(C117,playstats,2)","v":"Kevin King"},{"$f":"VLOOKUP(C117,playstats,6)","v":49},null,null,null,null,{"$f":"E117*3","v":147},{"$f":"I117+J117","v":147},{"$f":"IF(K117>K110,2,IF(K117=K110,1,0))","v":2}]
[null,null,null,null,null,{"$f":"SUM(F116:F117)","v":0},{"$f":"SUM(G116:G117)","v":0},{"$f":"SUM(H116:H117)","v":0},{"$f":"SUM(I116:I117)","v":0}]
[null,null,null,null,null,{"$f":"$E116+$E117","v":91},{"$f":"$E116+$E117","v":91},{"$f":"$E116+$E117","v":91},{"$f":"SUM(F119:H119)","v":273},{"$f":"SUM(J116:J117)","v":273},{"$f":"SUM(K116:K117)","v":273}]
[null,null,null,null,null,{"$f":"SUM(F118:F119)","v":91},{"$f":"SUM(G118:G119)","v":91},{"$f":"SUM(H118:H119)","v":91},{"$f":"SUM(I118:I119)","v":273}]
[null,null,null,null,null,{"$f":"IF(F120>F113,2,IF(F120=F113,1,0))","v":2},{"$f":"IF(G120>G113,2,IF(G120=G113,1,0))","v":2},{"$f":"IF(H120>H113,2,IF(H120=H113,1,0))","v":2},{"$f":"IF(I120>I113,2,IF(I120=I113,1,0))","v":2},null,null,{"$f":"SUM(L116:L120)+SUM(F121:I121)","v":12}]

{"sheet":"players","index":3,"n_rows":76,"n_cols":35,"rows_kept":76,"cut":false,"hidden":false,"merged":[[2,31,2,32],[2,33,2,34],[2,10,2,11],[2,8,2,9],[41,2,41,3],[41,10,41,11],[41,8,41,9],[2,20,2,21],[2,22,2,23]]}
[null,null,null,"Handicap Calc:",24,3442,null,{"$f":"IF(-INT((F1/E1-200)*0.75)<75,-INT((F1/E1-200)*0.75),75)","v":43}]
[]
[null,null,"playstats",null,null,null,null,null,"Game",null,"Series",null,null,null,"Previous week",null,null,null,null,null,"Game",null,"Series",null,null,null,"New High Scores",null,null,null,null,"Game",null,"Series"]
[null,null,null,null,"Games","Pins","Avge","Hcap","Scr","Hcap","Scr","Hcap",null,null,null,null,"Games","Pins","Avge","Hcap","Scr","Hcap","Scr","Hcap",null,null,null,"Games","Pins","Avge","Hcap","Scr","Hcap","Scr","Hcap"]
[null,1,11,"Chris Woodward",24,{"$f":"3964-363","v":3601},{"$f":"F5/E5","v":150.04166666666666},38,204,250,515,644,null,null,11,"Chris Woodward",24,{"$f":"3964-363","v":3601},{"$f":"R5/Q5","v":150.04166666666666},38,204,250,515,644,null,11,"Chris Woodward",{"$f":"E5-Q5","v":0},{"$f":"F5-R5","v":0},0,0,0,0,0,0]
[null,2,12,"Bunz Hughes",24,{"$f":"3792-345","v":3447},{"$f":"F6/E6","v":143.625},43,184,229,472,639,null,null,12,"Bunz Hughes",24,{"$f":"3792-345","v":3447},{"$f":"R6/Q6","v":143.625},43,184,229,472,639,null,12,"Bunz Hughes",{"$f":"E6-Q6","v":0},0,0,0,0,0,0,0]
[null,3,21,"Carl Briggs",9,1394,154.88888888888889,34,179,211,482,578,null,null,21,"Carl Briggs",9,1394,154.88888888888889,34,179,211,482,578,null,21,"Carl Briggs",0,0,0,0,0,0,0,0]
[null,4,22,"Gary Wileman",9,1308,145.33333333333334,41,166,222,492,636,null,null,22,"Gary Wileman",9,1308,145.33333333333334,41,166,222,492,636,null,22,"Gary Wileman",0,0,0,0,0,0,0,0]
[null,5,23,"Nathon Ferrie",6,929,154.83333333333334,34,197,237,488,608,null,null,23,"Nathon Ferrie",6,929,154.83333333333334,34,197,237,488,608,null,23,"Nathon Ferrie",0,0,0,0,0,0,0,0]
[null,6,31,"Sarah Shellard",24,3254,135.58333333333334,49,181,233,443,591,null,null,31,"Sarah Shellard",21,{"$f":"3194-368","v":2826},{"$f":"R10/Q10","v":134.57142857142858},50,181,233,443,591,null,31,"Sarah Shellard",3,428,1.0119047619047592,-1,0,0,0,0]
[null,7,32,"Ethan Taylor",21,{"$f":"3344-458","v":2886},{"$f":"F11/E11","v":137.42857142857142},47,172,224,475,619,null,null,32,"Ethan Taylor",21,{"$f":"3344-458","v":2886},137.42857142857142,47,172,224,475,619,null,32,"Ethan Taylor",0,0,0,0,0,0,0,0]
[null,8,33,"Owen Campbell",6,802,133.66666666666666,50,212,242,480,570,null,null,33,"Owen Campbell",3,480,160,30,212,242,480,570,null,33,"Owen Campbell",3,322,-26.333333333333343,20,0,0,0,0]
[null,9,41,"Lew Ashenden",27,3498,129.55555555555554,53,204,258,422,596,null,null,41,"Lew Ashenden",24,3103,129.29166666666666,54,168,226,422,596,null,41,"Lew Ashenden",3,395,0.26388888888888573,-1,36,32,0,0]
[null,10,42,"Chris Johnson",27,3643,134.92592592592592,49,188,239,483,651,null,null,42,"Chris Johnson",24,3287,136.95833333333334,48,188,239,483,651,null,42,"Chris Johnson",3,356,-2.032407407407419,1,0,0,0,0]
[null,11,51,"Tony Pearce",27,3594,133.11111111111111,51,164,215,433,592,null,null,51,"Tony Pearce",24,3180,132.5,51,161,214,433,592,null,51,"Tony Pearce",3,414,0.61111111111111427,0,3,1,0,0]
[null,12,52,"Richard Lester",24,3885,161.875,29,194,223,515,596,null,null,52,"Richard Lester",24,3885,161.875,29,194,223,515,596,null,52,"Richard Lester",0,0,0,0,0,0,0,0]
[null,13,61,"Diane MacFarlane",27,3934,145.7037037037037,41,191,231,520,640,null,null,61,"Diane MacFarlane",24,3522,146.75,40,191,231,520,640,null,61,"Diane MacFarlane",3,412,-1.0462962962963047,1,0,0,0,0]
[null,14,62,"Keith MacFarlane",27,4341,160.77777777777777,30,207,237,567,657,null,null,62,"Keith MacFarlane",24,3909,162.875,28,207,237,567,657,null,62,"Keith MacFarlane",3,432,-2.0972222222222285,2,0,0,0,0]
[null,15,63,"Mick King",null,null,null,null,null,null,null,null,null,null,63,"Mick King",null,null,null,null,null,null,null,null,null,63,"Mick King",0,0,0,0,0,0,0,0]
[null,16,71,"Steve Emmony",24,3927,163.625,28,227,253,571,649,null,null,71,"Steve Emmony",21,3506,166.95238095238096,25,227,253,571,649,null,71,"Steve Emmony",3,421,-3.3273809523809632,3,0,0,0,0]
[null,17,72,"Terry Emmony",21,3139,149.47619047619048,38,189,228,493,619,null,null,72,"Terry Emmony",18,2687,149.27777777777777,39,189,228,493,619,null,72,"Terry Emmony",3,{"$f":"F21-R21","v":452},{"$f":"G21-S21","v":0.19841269841271014},{"$f":"H21-T21","v":-1},{"$f":"I21-U21","v":0},{"$f":"J21-V21","v":0},{"$f":"K21-W21","v":0},{"$f":"L21-X21","v":0}]
[null,18,73,"Martin Cook",9,1304,144.88888888888889,42,199,249,504,654,null,null,73,"Martin Cook",9,1304,144.88888888888889,42,199,249,504,654,null,73,"Martin Cook",0,0,0,0,0,0,0,0]
[null,19,81,"Paul Simmons",15,2124,141.6,44,188,239,469,617,null,null,81,"Paul Simmons",12,1655,137.91666666666666,47,188,239,464,617,null,81,"Paul Simmons",3,469,3.6833333333333371,-3,0,0,5,0]
[null,20,82,"Liz Lake",18,2378,132.11111111111111,51,167,223,439,607,null,null,82,"Liz Lake",15,1984,132.26666666666668,51,167,223,439,607,null,82,"Liz Lake",3,394,-0.15555555555556566,0,0,0,0,0]
[null,21,83,"Donna Smith",21,2701,128.61904761904762,54,182,241,482,659,null,null,83,"Donna Smith",21,2701,128.61904761904762,54,182,241,482,659,null,83,"Donna Smith",0,0,0,0,0,0,0,0]
[null,22,91,"Karen Davies",15,1875,125,57,159,213,421,562,null,null,91,"Karen Davies",15,1875,125,57,159,213,421,562,null,91,"Karen Davies",0,0,0,0,0,0,0,0]
[null,23,92,"Martin Lapidge",24,3438,143.25,43,192,238,519,657,null,null,92,"Martin Lapidge",21,{"$f":"3359-440","v":2919},{"$f":"R27/Q27","v":139},46,183,231,496,640,null,92,"Martin Lapidge",3,519,4.25,-3,9,7,23,17]
[null,24,93,"Terry Highton",12,1905,158.75,31,198,235,543,654,null,null,93,"Terry Highton",9,{"$f":"1811-449","v":1362},151.33333333333334,37,186,229,520,649,null,93,"Terry Highton",3,543,7.4166666666666572,-6,12,6,23,5]
[null,25,101,"Kevin King",27,3644,134.96296296296296,49,194,242,443,587,null,null,101,"Kevin King",24,{"$f":"3640-411","v":3229},134.54166666666666,50,194,242,443,587,null,101,"Kevin King",3,415,0.42129629629630472,-1,0,0,0,0]
[null,26,102,"Karl King",27,3895,144.25925925925927,42,200,243,468,594,null,null,102,"Karl King",24,{"$f":"3886-444","v":3442},143.41666666666666,15,175,217,468,594,null,102,"Karl King",3,453,0.84259259259260944,27,25,26,0,0]
[]
[null,null,null,null,{"$f":"SUM(E5:E30)","v":495},{"$f":"SUM(F5:F30)","v":70846},{"$f":"F32/E32","v":143.12323232323232},{"$f":"G32-S32","v":-3.4545454545451548E-2},null,null,null,null,null,null,null,null,{"$f":"SUM(Q5:Q30)","v":450},{"$f":"SUM(R5:R30)","v":64421},{"$f":"R32/Q32","v":143.15777777777777},null,null,null,null,null,null,null,null,{"$f":"E32-Q32","v":45},{"$f":"F32-R32","v":6425},{"$f":"G32-S32","v":-3.4545454545451548E-2}]
[null,null,null,"playercount",26]
[]
[null,null,null,"Working area"]
["b/f",null,{"$f":"VLOOKUP(playercount,playerbf,2)","v":102},{"$f":"VLOOKUP(playercount,playerbf,3)","v":"Karl King"},{"$f":"VLOOKUP(playercount,playerbf,4)","v":27},{"$f":"VLOOKUP(playercount,playerbf,5)","v":3895},{"$f":"VLOOKUP(playercount,playerbf,6)","v":144.25925925925927},{"$f":"VLOOKUP(playercount,playerbf,7)","v":42},{"$f":"VLOOKUP(playercount,playerbf,8)","v":200},{"$f":"VLOOKUP(playercount,playerbf,9)","v":243},{"$f":"VLOOKUP(playercount,playerbf,10)","v":468},{"$f":"VLOOKUP(playercount,playerbf,11)","v":594}]
["week",5,{"$f":"VLOOKUP(B37,playbase,2)","v":102},null,3,{"$f":"VLOOKUP(B37,playbase,5)","v":453},{"$f":"VLOOKUP(B37,playbase,6)","v":151},{"$f":"VLOOKUP(B37,playbase,7)","v":42},{"$f":"VLOOKUP(B37,playbase,8)","v":200},{"$f":"VLOOKUP(B37,playbase,9)","v":242},{"$f":"VLOOKUP(B37,playbase,10)","v":453},{"$f":"VLOOKUP(B37,playbase,11)","v":579}]
["Back match","."]
["c/f",null,{"$f":"C36","v":102},{"$f":"D36","v":"Karl King"},{"$f":"SUM(E36:E38)","v":30},{"$f":"SUM(F36:F38)","v":4348},{"$f":"F39/E39","v":144.93333333333334},{"$f":"IF(-INT((F39/E39-200)*0.75)<75,-INT((F39/E39-200)*0.75),75)","v":42},{"$f":"MAX(I36:I38)","v":200},{"$f":"MAX(J36:J38)","v":243},{"$f":"MAX(K36:K38)","v":468},{"$f":"MAX(L36:L38)","v":594}]
[]
[]
[null,null,"playbase",null,null,null,null,null,"Game",null,"Series"]
[null,null,null,null,"Games","Pins","Avge","Hcap","Scr","Hcap","Scr","Hcap"]
[null,1,{"$f":"results!C49","v":81},{"$f":"VLOOKUP(C44,playstats,2)","v":"Paul Simmons"},3,{"$f":"results!I49","v":469},{"$f":"F44/E44","v":156.33333333333334},{"$f":"results!E49","v":44},{"$f":"MAX(results!F49:H49)","v":159},{"$f":"I44+H44","v":203},{"$f":"results!I49","v":469},{"$f":"K44+(3*H44)","v":601}]
[null,2,{"$f":"results!C50","v":82},"Liz Lake",3,{"$f":"results!I50","v":394},131.33333333333334,{"$f":"results!E50","v":51},{"$f":"MAX(results!F50:H50)","v":143},194,{"$f":"results!I50","v":394},547]
[null,3,{"$f":"results!C57","v":72},"Terry Emmony",3,{"$f":"results!I57","v":452},150.66666666666666,{"$f":"results!E57","v":38},{"$f":"MAX(results!F57:H57)","v":179},217,{"$f":"results!I57","v":452},566]
[null,4,{"$f":"results!C56","v":71},"Steve Emmony",3,{"$f":"results!I56","v":421},140.33333333333334,{"$f":"results!E56","v":28},{"$f":"MAX(results!F56:H56)","v":149},177,{"$f":"results!I56","v":421},505]
[null,5,{"$f":"results!C19","v":102},"Karl King",3,{"$f":"results!I19","v":453},151,{"$f":"results!E19","v":42},{"$f":"MAX(results!F19:H19)","v":200},242,{"$f":"results!I19","v":453},579]
[null,6,{"$f":"results!C20","v":101},"Kevin King",3,{"$f":"results!I20","v":415},138.33333333333334,{"$f":"results!E20","v":49},{"$f":"MAX(results!F20:H20)","v":179},228,{"$f":"results!I20","v":415},562]
[null,7,{"$f":"results!C4","v":41},"Lew Ashenden",3,{"$f":"results!I4","v":395},131.66666666666666,{"$f":"results!E4","v":53},{"$f":"MAX(results!F4:H4)","v":204},257,{"$f":"results!I4","v":395},554]
[null,8,{"$f":"results!C5","v":42},"Chris Johnson",3,{"$f":"results!I5","v":356},118.66666666666667,{"$f":"results!E5","v":49},{"$f":"MAX(results!F5:H5)","v":139},188,{"$f":"results!I5","v":356},503]
[null,9,{"$f":"results!C34","v":61},"Diane MacFarlane",3,{"$f":"results!I34","v":412},137.33333333333334,{"$f":"results!E34","v":41},{"$f":"MAX(results!F34:H34)","v":144},185,{"$f":"results!I34","v":412},535]
[null,10,{"$f":"results!C35","v":62},"Keith MacFarlane",3,{"$f":"results!I35","v":432},144,{"$f":"results!E35","v":30},{"$f":"MAX(results!F35:H35)","v":175},205,{"$f":"results!I35","v":432},522]
[null,11,{"$f":"results!C11","v":31},"Sarah Shellard",3,{"$f":"results!I11","v":428},142.66666666666666,{"$f":"results!E11","v":49},{"$f":"MAX(results!F11:H11)","v":156},205,{"$f":"results!I11","v":428},575]
[null,12,{"$f":"results!C12","v":33},"Owen Campbell",3,{"$f":"results!I12","v":322},107.33333333333333,{"$f":"results!E12","v":50},{"$f":"MAX(results!F12:H12)","v":135},185,{"$f":"results!I12","v":322},472]
[null,13,{"$f":"results!C41","v":51},"Tony Pearce",3,{"$f":"results!I41","v":414},138,{"$f":"results!E41","v":51},{"$f":"MAX(results!F41:H41)","v":164},215,{"$f":"results!I41","v":414},567]
[null,14,{"$f":"results!C42","v":52},"Richard Lester",3,{"$f":"results!I42","v":387},129,{"$f":"results!E42","v":29},{"$f":"MAX(results!F42:H42)","v":129},158,{"$f":"results!I42","v":387},474]
[null,15,{"$f":"results!C27","v":93},"Terry Highton",3,{"$f":"results!I27","v":543},181,{"$f":"results!E27","v":31},{"$f":"MAX(results!F27:H27)","v":198},229,{"$f":"results!I27","v":543},636]
[null,16,{"$f":"results!C26","v":92},"Martin Lapidge",3,{"$f":"results!I26","v":519},173,{"$f":"results!E26","v":43},{"$f":"MAX(results!F26:H26)","v":192},235,{"$f":"results!I26","v":519},648]
[null,17,{"$f":"results!C64","v":21},{"$f":"VLOOKUP(C60,playstats,2)","v":"Carl Briggs"},3,{"$f":"results!I64","v":0},{"$f":"F60/E60","v":0},{"$f":"results!E64","v":34},{"$f":"MAX(results!F64:H64)","v":0},{"$f":"I60+H60","v":34},{"$f":"results!I64","v":0},{"$f":"K60+(3*H60)","v":102}]
[null,18,{"$f":"results!C65","v":23},"Nathon Ferrie",3,{"$f":"results!I65","v":0},0,{"$f":"results!E65","v":34},{"$f":"MAX(results!F65:H65)","v":0},34,{"$f":"results!I65","v":0},102]
[null,19,{"$f":"results!C71","v":102},"Karl King",3,{"$f":"results!I71","v":0},0,{"$f":"results!E71","v":42},{"$f":"MAX(results!F71:H71)","v":0},42,{"$f":"results!I71","v":0},126]
[null,20,{"$f":"results!C72","v":101},"Kevin King",3,{"$f":"results!I72","v":0},0,{"$f":"results!E72","v":49},{"$f":"MAX(results!F72:H72)","v":0},49,{"$f":"results!I72","v":0},147]
[null,21,{"$f":"results!C79","v":92},"Martin Lapidge",3,{"$f":"results!I79","v":0},0,{"$f":"results!E79","v":43},{"$f":"MAX(results!F79:H79)","v":0},43,{"$f":"results!I79","v":0},129]
[null,22,{"$f":"results!C80","v":91},"Karen Davies",3,{"$f":"results!I80","v":0},0,{"$f":"results!E80","v":57},{"$f":"MAX(results!F80:H80)","v":0},57,{"$f":"results!I80","v":0},171]
[null,23,{"$f":"results!C86","v":102},"Karl King",3,{"$f":"results!I86","v":0},0,{"$f":"results!E86","v":42},{"$f":"MAX(results!F86:H86)","v":0},42,{"$f":"results!I86","v":0},126]
[null,24,{"$f":"results!C87","v":101},"Kevin King",3,{"$f":"results!I87","v":0},0,{"$f":"results!E87","v":49},{"$f":"MAX(results!F87:H87)","v":0},49,{"$f":"results!I87","v":0},147]
[null,25,{"$f":"results!C94","v":51},"Tony Pearce",3,{"$f":"results!I94","v":0},0,{"$f":"results!E94","v":51},{"$f":"MAX(results!F94:H94)","v":0},51,{"$f":"results!I94","v":0},153]
[null,26,{"$f":"results!C95","v":52},"Richard Lester",3,{"$f":"results!I95","v":0},0,{"$f":"results!E95","v":29},{"$f":"MAX(results!F95:H95)","v":0},29,{"$f":"results!I95","v":0},87]
[null,27,{"$f":"results!C101","v":102},"Karl King",3,{"$f":"results!I101","v":0},0,{"$f":"results!E101","v":42},{"$f":"MAX(results!F101:H101)","v":0},42,{"$f":"results!I101","v":0},126]
[null,28,{"$f":"results!C102","v":101},"Kevin King",3,{"$f":"results!I102","v":0},0,{"$f":"results!E102","v":49},{"$f":"MAX(results!F102:H102)","v":0},49,{"$f":"results!I102","v":0},147]
[null,29,{"$f":"results!C109","v":11},"Chris Woodward",3,{"$f":"results!I109","v":0},0,{"$f":"results!E109","v":38},{"$f":"MAX(results!F109:H109)","v":0},38,{"$f":"results!I109","v":0},114]
[null,30,{"$f":"results!C110","v":12},"Bunz Hughes",3,{"$f":"results!I110","v":0},0,{"$f":"results!E110","v":43},{"$f":"MAX(results!F110:H110)","v":0},43,{"$f":"results!I110","v":0},129]
[null,31,{"$f":"results!C116","v":102},"Karl King",3,{"$f":"results!I116","v":0},0,{"$f":"results!E116","v":42},{"$f":"MAX(results!F116:H116)","v":0},42,{"$f":"results!I116","v":0},126]
[null,32,{"$f":"results!C117","v":101},"Kevin King",3,{"$f":"results!I117","v":0},0,{"$f":"results!E117","v":49},{"$f":"MAX(results!F117:H117)","v":0},49,{"$f":"results!I117","v":0},147]
[null,null,null,null,null,{"$f":"SUM(F44:F75)","v":6812}]

{"sheet":"teams","index":4,"n_rows":46,"n_cols":47,"rows_kept":46,"cut":false,"hidden":false,"merged":[[16,42,16,43],[16,44,16,45],[16,19,16,20],[16,21,16,22],[2,13,2,14],[2,15,2,16],[2,19,2,20],[2,21,2,22],[2,39,2,40],[2,43,2,44],[2,45,2,46],[2,25,2,26],[2,27,2,28],[2,31,2,32],[2,33,2,34],[2,37,2,38]]}
[]
[null,null,null,null,null,null,null,null,null,null,null,null,null,null,null,null,null,null,null,null,null,null,null,null,null,"Last Week",9,null,null,null,null,null,null,null,null,null,null,"New High Scores"]
[null,null,"teams",null,null,null,null,null,null,null,null,null,null,"teamstats",null,"Points",null,null,null,"High Game",null,"High Series",null,null,null,"teamstats",null,"Points",null,null,null,"High Game",null,"High Series",null,null,null,null,null,"Points",null,null,null,"High Game",null,"High Series"]
[null,1,"Hot Chris Bunz",11,"Chris Woodward",12,"Bunz Hughes",null,null,null,null,null,null,null,"Played","Won","Lost","Pins","Avge","Scratch","Hcap","Scratch","Hcap",null,null,null,"Played","Won","Lost","Pins","Avge","Scratch","Hcap","Scratch","Hcap",null,null,null,"Played","Won","Lost","Pins","Avge","Scratch","Hcap","Scratch","Hcap"]
[null,2,"Stealth Bowlers",21,"Carl Briggs",{"$f":"D5+1","v":22},"Gary Wileman",23,"Nathon Ferrie",null,null,null,1,"Hot Chris Bunz",8,64,32,9373,390.54166666666669,352,442,958,1225,null,1,"Hot Chris Bunz",8,64,32,9373,390.54166666666669,352,442,958,1225,null,1,"Hot Chris Bunz",{"$f":"O5-AA5","v":0},{"$f":"P5-AB5","v":0},0,0,0,0,0,0,0]
[null,3,"Chucklers",31,"Sarah Shellard",{"$f":"D6+1","v":32},"Ethan Taylor",33,"Owen Campbell",null,null,null,2,"Stealth Bowlers",null,null,null,null,null,null,null,null,null,null,2,"Stealth Bowlers",4,40,8,4648,387.33333333333331,339,419,974,1214,null,2,"Stealth Bowlers"]
[null,4,"Boom",41,"Lew Ashenden",42,"Chris Johnson",null,null,null,null,null,3,"Chucklers",9,42,66,9765,361.66666666666669,368,446,910,1210,null,3,"Chucklers",8,38,58,8775,365.625,368,446,910,1210,null,3,"Chucklers",{"$f":"O7-AA7","v":1},4,8,990,-3.9583333333333144,0,0,0,0]
[null,5,"Duo",51,"Tony Pearce",52,"Richard Lester",null,null,null,null,null,4,"Boom",9,59,49,9997,370.25925925925924,343,447,905,1232,null,4,"Boom",8,51,45,8940,372.5,343,447,905,1232,null,4,"Boom",1,8,4,1057,-2.2407407407407618,0,0,0,0]
[null,6,"Mac Too",61,"Diane MacFarlane",62,"Keith MacFarlane",{"$f":"F9+1","v":63},"Mick King",null,null,null,5,"Duo",9,56,52,10011,370.77777777777777,323,398,916,1153,null,5,"Duo",8,52,44,8970,373.75,323,398,916,1153,null,5,"Duo",1,4,8,1041,-2.9722222222222285,0,0,0,0]
[null,7,"Brothers Grimm",{"$f":"B10*10+1","v":71},"Steve Emmony",72,"Terry Emmony",{"$f":"F10+1","v":73},"Martin Cook",null,null,null,6,"Mac Too",9,48,60,9925,367.59259259259261,383,433,1004,1154,null,6,"Mac Too",8,40,56,8877,369.875,383,433,1004,1154,null,6,"Mac Too",1,8,4,1048,-2.2824074074073906,0,0,0,0]
[null,8,"Hit & Miss",81,"Paul Simmons",82,"Liz Lake",{"$f":"F11+1","v":83},"Donna Smith",null,null,null,7,"Brothers Grimm",9,78,30,10263,380.11111111111109,368,457,1006,1263,null,7,"Brothers Grimm",8,74,22,9198,383.25,368,457,1006,1263,null,7,"Brothers Grimm",1,4,8,1065,-3.1388888888889142,0,0,0,0]
[null,9,"Just Friends",{"$f":"F12+1","v":92},"Martin Lapidge",{"$f":"B12*10+1","v":91},"Karen Davies",{"$f":"D12+1","v":93},"Terry Highton",null,null,null,8,"Hit & Miss",9,54,54,10086,373.55555555555554,342,457,921,1266,null,8,"Hit & Miss",8,46,50,8929,372.04166666666669,342,457,921,1266,null,8,"Hit & Miss",1,8,4,1157,1.5138888888888573,0,0,0,0]
[null,10,"The Kings",102,"Karl King",101,"Kevin King",null,null,null,null,null,9,"Just Friends",9,48,60,10149,375.88888888888891,358,441,1062,1311,null,9,"Just Friends",8,38,58,8838,368.25,353,431,913,1186,null,9,"Just Friends",1,10,2,1311,7.6388888888889142,5,10,149,125]
[null,null,null,null,null,null,null,null,null,null,null,null,10,"The Kings",9,31,77,9924,367.55555555555554,379,471,891,1155,null,10,"The Kings",8,29,67,8780,365.83333333333331,345,433,891,1155,null,10,"The Kings",1,2,10,1144,1.7222222222222285,34,38,0,0]
[null,null,null,null,null,null,null,null,null,null,null,null,null,"Check Total",{"$f":"SUM(O5:O14)","v":80},{"$f":"SUM(P5:P14)","v":480},{"$f":"SUM(Q5:Q14)","v":480},{"$f":"SUM(R5:R14)","v":89493},{"$f":"R15/(O15*3)","v":372.88749999999999},{"$f":"SUM(T5:T14)","v":3216},{"$f":"SUM(U5:U14)","v":3992},{"$f":"SUM(V5:V14)","v":8573},{"$f":"SUM(W5:W14)","v":10969},null,null,"Check Total",{"$f":"SUM(AA5:AA14)","v":76},{"$f":"SUM(AB5:AB14)","v":472},{"$f":"SUM(AC5:AC14)","v":440},{"$f":"SUM(AD5:AD14)","v":85328},{"$f":"AD15/(AA15*3)","v":374.24561403508773},{"$f":"SUM(AF5:AF14)","v":3516},{"$f":"SUM(AG5:AG14)","v":4363},{"$f":"SUM(AH5:AH14)","v":9398},{"$f":"SUM(AI5:AI14)","v":12058}]
[]
[null,null,null,null,null,null,null,null,null,null,null,null,null,"teambase",null,"Points",null,null,null,"High Game",null,"Series",null,null,null,null,null,null,null,null,null,null,null,null,null,null,null,null,null,null,null,null,"Game",null,"Series"]
[null,null,null,null,null,null,null,null,null,null,null,null,null,null,"Played","Won","Lost","Pins","Avge","Scratch","Hcap","Scratch","Hcap",null,null,null,null,null,null,null,null,null,null,null,null,null,null,null,"Games","Pins","Avge","Hcap","Scr","Hcap","Scr","Hcap"]
[null,null,null,null,null,null,null,null,null,null,1,8,{"$f":"results!B11","v":3},{"$f":"VLOOKUP(M19,teams,2)","v":"Chucklers"},1,{"$f":"results!L16","v":4},{"$f":"12-P19","v":8},{"$f":"results!I15","v":1047},{"$f":"R19/3","v":349},{"$f":"MAX(results!F13:'results'!H13)","v":291},{"$f":"MAX(results!F15:'results'!H15)","v":390},{"$f":"results!I13","v":750},{"$f":"results!I15","v":1047},null,null,null,null,null,null,null,null,null,null,null,null,null,11,"Chris Woodward",0,0,0,0,0,0,0,0]
[null,null,null,null,null,null,null,null,null,null,null,6,{"$f":"results!B4","v":4},"Boom",1,{"$f":"results!L9","v":8},4,{"$f":"results!I8","v":1057},352.33333333333331,{"$f":"MAX(results!F6:'results'!H6)","v":327},{"$f":"MAX(results!F8:'results'!H8)","v":429},{"$f":"results!I6","v":751},{"$f":"results!I8","v":1057},null,null,null,null,null,null,null,null,null,null,null,null,null,12,"Bunz Hughes",0,0,0,0,0,0,0,0]
[null,null,null,null,null,null,null,null,null,null,2,5,{"$f":"results!B41","v":5},"Duo",1,{"$f":"results!L46","v":4},8,{"$f":"results!I45","v":1041},347,{"$f":"MAX(results!F43:'results'!H43)","v":293},{"$f":"MAX(results!F45:'results'!H45)","v":373},{"$f":"results!I43","v":801},{"$f":"results!I45","v":1041},null,null,null,null,null,null,null,null,null,null,null,null,null,21,"Carl Briggs",0,0,0,0,0,0,0,0]
[null,null,null,null,null,null,null,null,null,null,null,1,{"$f":"results!B34","v":6},"Mac Too",1,{"$f":"results!L39","v":8},4,{"$f":"results!I38","v":1057},352.33333333333331,{"$f":"MAX(results!F36:'results'!H36)","v":319},{"$f":"MAX(results!F38:'results'!H38)","v":390},{"$f":"results!I36","v":844},{"$f":"results!I38","v":1057},null,null,null,null,null,null,null,null,null,null,null,null,null,22,"Gary Wileman",0,0,0,0,0,0,0,0]
[null,null,null,null,null,null,null,null,null,null,3,4,{"$f":"results!B56","v":7},"Brothers Grimm",1,{"$f":"results!L61","v":4},8,{"$f":"results!I60","v":1071},357,{"$f":"MAX(results!F58:'results'!H58)","v":328},{"$f":"MAX(results!F60:'results'!H60)","v":394},{"$f":"results!I58","v":873},{"$f":"results!I60","v":1071},null,null,null,null,null,null,null,null,null,null,null,null,null,23,"Nathon Ferrie",0,0,0,0,0,0,0,0]
[null,null,null,null,null,null,null,null,null,null,null,2,{"$f":"results!B49","v":8},"Hit & Miss",1,{"$f":"results!L54","v":8},4,{"$f":"results!I53","v":1148},382.66666666666669,{"$f":"MAX(results!F51:'results'!H51)","v":302},{"$f":"MAX(results!F53:'results'!H53)","v":397},{"$f":"results!I51","v":863},{"$f":"results!I53","v":1148},null,null,null,null,null,null,null,null,null,null,null,null,null,31,"Sarah Shellard",3,428,1.0119047619047592,-1,0,0,0,0]
[null,null,null,null,null,null,null,null,null,null,4,3,{"$f":"results!B26","v":9},"Just Friends",1,{"$f":"results!L31","v":10},2,{"$f":"results!I30","v":1284},428,{"$f":"MAX(results!F28:'results'!H28)","v":358},{"$f":"MAX(results!F30:'results'!H30)","v":432},{"$f":"results!I28","v":1062},{"$f":"results!I30","v":1284},null,null,null,null,null,null,null,null,null,null,null,null,null,32,"Ethan Taylor",0,0,0,0,0,0,0,0]
[null,null,null,null,null,null,null,null,null,null,null,7,{"$f":"results!B19","v":10},"The Kings",1,{"$f":"results!L24","v":2},10,{"$f":"results!I23","v":1141},380.33333333333331,{"$f":"MAX(results!F21:'results'!H21)","v":379},{"$f":"MAX(results!F23:'results'!H23)","v":470},{"$f":"results!I21","v":868},{"$f":"results!I23","v":1141},null,null,null,null,null,null,null,null,null,null,null,null,null,33,"Owen Campbell",3,322,-26.333333333333343,20,0,0,0,0]
[null,null,null,null,null,null,null,null,null,null,5,9,{"$f":"results!B64","v":2},{"$f":"VLOOKUP(M27,teams,2)","v":"Stealth Bowlers"},1,{"$f":"results!L69","v":0},{"$f":"12-P27","v":12},{"$f":"results!I68","v":204},{"$f":"R27/3","v":68},{"$f":"MAX(results!F66:'results'!H66)","v":0},{"$f":"MAX(results!F68:'results'!H68)","v":68},{"$f":"results!I66","v":0},{"$f":"results!I68","v":204},null,null,null,null,null,null,null,null,null,null,null,null,null,41,"Lew Ashenden",3,395,0.26388888888888573,-1,36,32,0,0]
[null,null,null,null,null,null,null,null,null,null,null,10,{"$f":"results!B71","v":10},"The Kings",1,{"$f":"results!L76","v":12},0,{"$f":"results!I75","v":273},91,{"$f":"MAX(results!F73:'results'!H73)","v":0},{"$f":"MAX(results!F75:'results'!H75)","v":91},{"$f":"results!I73","v":0},{"$f":"results!I75","v":273},null,null,null,null,null,null,null,null,null,null,null,null,null,42,"Chris Johnson",3,356,-2.032407407407419,1,0,0,0,0]
[null,null,null,null,null,null,null,null,null,null,6,11,{"$f":"results!B79","v":9},"Just Friends",1,{"$f":"results!L84","v":12},0,{"$f":"results!I83","v":300},100,{"$f":"MAX(results!F81:'results'!H81)","v":0},{"$f":"MAX(results!F83:'results'!H83)","v":100},{"$f":"results!I81","v":0},{"$f":"results!I83","v":300},null,null,null,null,null,null,null,null,null,null,null,null,null,51,"Tony Pearce",3,414,0.61111111111111427,0,3,1,0,0]
[null,null,null,null,null,null,null,null,null,null,null,12,{"$f":"results!B86","v":10},"The Kings",1,{"$f":"results!L91","v":0},12,{"$f":"results!I90","v":273},91,{"$f":"MAX(results!F88:'results'!H88)","v":0},{"$f":"MAX(results!F90:'results'!H90)","v":91},{"$f":"results!I96","v":0},{"$f":"results!I90","v":273},null,null,null,null,null,null,null,null,null,null,null,null,null,52,"Richard Lester",0,0,0,0,0,0,0,0]
[null,null,null,null,null,null,null,null,null,null,7,13,{"$f":"results!B94","v":5},"Duo",1,{"$f":"results!L99","v":2},10,{"$f":"results!I98","v":240},80,{"$f":"MAX(results!F96:'results'!H96)","v":0},{"$f":"MAX(results!F98:'results'!H98)","v":80},{"$f":"results!I96","v":0},{"$f":"results!I98","v":240},null,null,null,null,null,null,null,null,null,null,null,null,null,61,"Diane MacFarlane",3,412,-1.0462962962963047,1,0,0,0,0]
[null,null,null,null,null,null,null,null,null,null,null,14,{"$f":"results!B101","v":10},"The Kings",1,{"$f":"results!L106","v":10},2,{"$f":"results!I105","v":273},91,{"$f":"MAX(results!F103:'results'!H103)","v":0},{"$f":"MAX(results!F66:'results'!H66)","v":0},{"$f":"results!I103","v":0},{"$f":"results!I105","v":273},null,null,null,null,null,null,null,null,null,null,null,null,null,62,"Keith MacFarlane",3,432,-2.0972222222222285,2,0,0,0,0]
[null,null,null,null,null,null,null,null,null,null,8,15,{"$f":"results!B109","v":1},"Hot Chris Bunz",1,{"$f":"results!L114","v":0},12,{"$f":"results!I113","v":243},81,{"$f":"MAX(results!F111:'results'!H111)","v":0},{"$f":"MAX(results!F113:'results'!H113)","v":81},{"$f":"results!I111","v":0},{"$f":"results!I113","v":243},null,null,null,null,null,null,null,null,null,null,null,null,null,63,"Mick King",0,0,0,0,0,0,0,0]
[null,null,null,null,null,null,null,null,null,null,null,16,{"$f":"results!B116","v":10},"The Kings",1,{"$f":"results!L121","v":12},0,{"$f":"results!I120","v":273},91,{"$f":"MAX(results!F118:'results'!H118)","v":0},{"$f":"MAX(results!F68:'results'!H68)","v":68},{"$f":"results!I118","v":0},{"$f":"results!I120","v":273},null,null,null,null,null,null,null,null,null,null,null,null,null,71,"Steve Emmony",3,421,-3.3273809523809632,3,0,0,0,0]
[null,null,null,null,null,null,null,null,null,null,null,null,null,null,null,{"$f":"SUM(P19:P34)","v":96},{"$f":"SUM(Q19:Q34)","v":96},{"$f":"SUM(R19:R34)","v":10925},null,null,null,null,null,null,null,null,null,null,null,null,null,null,null,null,null,null,72,"Terry Emmony",3,452,0.19841269841271014,-1,0,0,0,0]
[null,null,null,null,null,null,null,null,null,null,null,null,null,null,null,null,null,null,null,{"$f":"RANK(1,T19:T34,0)","v":{"$error":"#N/A"}},null,null,null,null,null,null,null,null,null,null,null,null,null,null,null,null,73,"Martin Cook",0,0,0,0,0,0,0,0]
[null,null,null,null,null,null,null,null,null,null,null,null,null,"teamcount",10,null,null,null,null,null,null,null,null,null,null,null,null,null,null,null,null,null,null,null,null,null,81,"Paul Simmons",3,469,3.6833333333333371,-3,0,0,5,0]
[null,null,null,null,null,null,null,null,null,null,null,null,null,null,null,null,null,null,null,null,null,null,null,null,null,null,null,null,null,null,null,null,null,null,null,null,82,"Liz Lake",3,394,-0.15555555555556566,0,0,0,0,0]
[null,null,null,null,null,null,null,null,null,null,null,null,null,"Working area",null,null,null,null,null,null,null,null,null,null,null,null,null,null,null,null,null,null,null,null,null,null,83,"Donna Smith",0,0,0,0,0,0,0,0]
[null,null,null,null,null,null,null,null,null,null,"b/f",null,{"$f":"teamcount","v":10},{"$f":"VLOOKUP(teamcount,teamstats,2)","v":"The Kings"},{"$f":"VLOOKUP(teamcount,teamstats,3)","v":9},{"$f":"VLOOKUP(teamcount,teamstats,4)","v":31},{"$f":"VLOOKUP(teamcount,teamstats,5)","v":77},{"$f":"VLOOKUP(teamcount,teamstats,6)","v":9924},{"$f":"VLOOKUP(teamcount,teamstats,7)","v":367.55555555555554},{"$f":"VLOOKUP(teamcount,teamstats,8)","v":379},{"$f":"VLOOKUP(teamcount,teamstats,9)","v":471},{"$f":"VLOOKUP(teamcount,teamstats,10)","v":891},{"$f":"VLOOKUP(teamcount,teamstats,11)","v":1155},null,null,null,null,null,null,null,null,null,null,null,null,null,91,"Karen Davies",0,0,0,0,0,0,0,0]
[null,null,null,null,null,null,null,null,null,null,"week",null,{"$f":"teamcount","v":10},{"$f":"VLOOKUP(teamcount,teambase,2)","v":"The Kings"},{"$f":"VLOOKUP(teamcount,teambase,3)","v":1},{"$f":"VLOOKUP(teamcount,teambase,4)","v":2},{"$f":"VLOOKUP(teamcount,teambase,5)","v":10},{"$f":"VLOOKUP(teamcount,teambase,6)","v":1141},{"$f":"VLOOKUP(teamcount,teambase,7)","v":380.33333333333331},{"$f":"VLOOKUP(teamcount,teambase,8)","v":379},{"$f":"VLOOKUP(teamcount,teambase,9)","v":470},{"$f":"VLOOKUP(teamcount,teambase,10)","v":868},{"$f":"VLOOKUP(teamcount,teambase,11)","v":1141},null,null,null,null,null,null,null,null,null,null,null,null,null,92,"Martin Lapidge",3,519,4.25,-3,9,7,23,17]
[null,null,null,null,null,null,null,null,null,null,"Back match",null,null,null,null,null,null,null,null,null,null,null,null,null,null,null,null,null,null,null,null,null,null,null,null,null,93,"Terry Highton",3,543,7.4166666666666572,-6,12,6,23,5]
[null,null,null,null,null,null,null,null,null,null,"c/f",null,{"$f":"M41","v":10},{"$f":"N41","v":"The Kings"},{"$f":"SUM(O40:O42)","v":10},{"$f":"SUM(P40:P42)","v":33},{"$f":"SUM(Q40:Q42)","v":87},{"$f":"SUM(R40:R42)","v":11065},{"$f":"R43/(O43*3)","v":368.83333333333331},{"$f":"MAX(T40:T42)","v":379},{"$f":"MAX(U40:U42)","v":471},{"$f":"MAX(V40:V42)","v":891},{"$f":"MAX(W40:W42)","v":1155},null,null,null,null,null,null,null,null,null,null,null,null,null,101,"Kevin King",3,415,0.42129629629630472,-1,0,0,0,0]
[null,null,null,null,null,null,null,null,null,null,null,null,null,null,null,null,null,null,null,null,null,null,null,null,null,null,null,null,null,null,null,null,null,null,null,null,102,"Karl King",3,453,0.84259259259260944,27,25,26,0,0]
[]
[null,null,null,null,null,null,null,null,null,null,null,null,null,null,null,null,null,null,null,null,null,null,null,null,null,null,null,null,null,null,null,null,null,null,null,null,null,null,24,3477,0.10438184663536276]

{"sheet":"reports","index":5,"n_rows":57,"n_cols":48,"rows_kept":57,"cut":false,"hidden":false,"merged":[[24,33,24,34],[24,35,24,36],[12,33,12,34],[12,35,12,36],[5,35,5,36],[6,33,6,34],[6,35,6,36],[18,33,18,34],[18,35,18,36],[6,2,6,12],[4,28,4,29],[8,5,8,6],[4,30,4,31],[5,33,5,34],[18,17,18,18],[23,14,23,15],[23,17,23,18],[18,14,18,16],[19,17,19,18],[19,14,19,15],[8,40,8,41],[8,42,8,43],[8,44,8,45],[8,46,8,47],[39,5,39,6],[39,9,39,10],[39,11,39,12],[27,14,27,15],[27,17,27,18],[31,14,31,15],[31,17,31,18],[39,28,39,29],[39,30,39,31],[8,9,8,10],[8,11,8,12],[8,7,8,8]]}
[null,null,null,"front",null,null,null,null,null,null,null,null,null,null,null,null,null,null,null,null,null,null,null,"back"]
[]
[]
[null,null,null,null,null,null,null,null,null,null,null,null,null,null,null,null,null,null,null,null,null,null,null,null,"Players Averages"]
[null,null,null,null,null,null,null,null,null,null,null,null,null,null,null,null,null,null,null,null,null,null,null,null,null,null,null,null,"Game",null,"Series",null,null,"High Scores - League to date"]
[null,null,"Monday Doubles League - Summer 2013",null,null,null,null,null,null,null,null,null,null,null,"Results",null,null,null,null,null,null,null,null,null,"Games","Pins","Avge","Hcap","Scr","Hcap","Scr","Hcap",null,"Players",null,"Team",null,null,"Copied from front page, for high scores"]
[null,null,{"$f":"\"League Table after Week \"&results!F2&\",  \"&\"15 July\"","v":"League Table after Week 10,  15 July"},null,null,null,null,null,null,null,null,null,null,null,null,null,null,null,null,null,null,1,71,"Steve Emmony",24,3927,163.625,28,227,253,571,649,null,"Scratch Game",null,"Scratch Game"]
[null,null,null,null,null,null,null,null,null,null,null,null,null,null,"Boom",1057,8,"Chucklers",4,990,null,2,52,"Richard Lester",24,3885,161.875,29,194,223,515,596,null,"Steve Emmony",227,"Mac Too",383]
[null,null,null,null,null,"Points",null,"Hcap",null,"High Game",null,"High Series",null,null,"The Kings",1144,2,"Just Friends",10,1311,null,3,62,"Keith MacFarlane",27,4341,160.77777777777777,30,207,237,567,657,null,"Owen Campbell",212,"The Kings",379,null,null,null,"Points",null,"Hcap",null,"High Game",null,"High Series"]
[null,null,null,null,"Played","Won","Lost","Pins","Avge","Scratch","Hcap","Scratch","Hcap",null,"Mac Too",1048,8,"Duo",4,1041,null,4,93,"Terry Highton",12,1905,158.75,31,198,235,543,654,null,"Keith MacFarlane",207,"Brothers Grimm",368,null,null,"Played","Won","Lost","Pins","Avge","Scratch","Hcap","Scratch","Hcap"]
[null,null,1,"Brothers Grimm",9,78,30,10263,380.11111111111109,368,457,1006,1263,null,"Hit & Miss",1157,8,"Brothers Grimm",4,1065,null,5,21,"Carl Briggs",9,1394,154.88888888888889,34,179,211,482,578,null,"Chris Woodward",204,"Chucklers",368,null,"Just Friends",9,48,60,10149,375.88888888888891,358,441,1062,1311]
[null,null,2,"Hot Chris Bunz",8,64,32,9373,390.54166666666669,352,442,958,1225,null,null,null,null,null,null,null,null,6,23,"Nathon Ferrie",6,929,154.83333333333334,34,197,237,488,608,null,"Lew Ashenden",204,"Just Friends",358,null,"Hit & Miss",9,54,54,10086,373.55555555555554,342,457,921,1266]
[null,null,3,"Boom",9,59,49,9997,370.25925925925924,343,447,905,1232,null,null,null,null,null,null,null,null,7,11,"Chris Woodward",24,3601,150.04166666666666,38,204,250,515,644,null,"Scratch Series",null,"Scratch Series",null,null,"Brothers Grimm",9,78,30,10263,380.11111111111109,368,457,1006,1263]
[null,null,4,"Duo",9,56,52,10011,370.77777777777777,323,398,916,1153,null,null,null,null,null,null,null,null,8,72,"Terry Emmony",21,3139,149.47619047619048,38,189,228,493,619,null,"Steve Emmony",571,"Just Friends",1062,null,"Boom",9,59,49,9997,370.25925925925924,343,447,905,1232]
[null,null,5,"Hit & Miss",9,54,54,10086,373.55555555555554,342,457,921,1266,null,null,null,null,null,null,null,null,9,61,"Diane MacFarlane",27,3934,145.7037037037037,41,191,231,520,640,null,"Keith MacFarlane",567,"Brothers Grimm",1006,null,"Hot Chris Bunz",8,64,32,9373,390.54166666666669,352,442,958,1225]
[null,null,6,"Just Friends",9,48,60,10149,375.88888888888891,358,441,1062,1311,null,null,null,null,null,null,null,null,10,22,"Gary Wileman",9,1308,145.33333333333334,41,166,222,492,636,null,"Terry Highton",543,"Mac Too",1004,null,"Chucklers",9,42,66,9765,361.66666666666669,368,446,910,1210]
[null,null,7,"Mac Too",9,48,60,9925,367.59259259259261,383,433,1004,1154,null,null,null,null,null,null,null,null,11,73,"Martin Cook",9,1304,144.88888888888889,42,199,249,504,654,null,"Diane MacFarlane",520,"Hot Chris Bunz",958,null,"The Kings",9,31,77,9924,367.55555555555554,379,471,891,1155]
[null,null,8,"Chucklers",9,42,66,9765,361.66666666666669,368,446,910,1210,null,"High Scores this week",null,null,null,null,null,null,12,102,"Karl King",27,3895,144.25925925925927,42,200,243,468,594,null,"Martin Lapidge",519,"Hit & Miss",921,null,"Mac Too",9,48,60,9925,367.59259259259261,383,433,1004,1154]
[null,null,9,"The Kings",9,31,77,9924,367.55555555555554,379,471,891,1155,null,"Players",null,null,"Team",null,null,null,13,12,"Bunz Hughes",24,3447,143.625,43,184,229,472,639,null,"Handicap Game",null,"Handicap Game",null,null,"Duo",9,56,52,10011,370.77777777777777,323,398,916,1153]
[null,null,10,"Stealth Bowlers",null,null,null,null,null,null,null,null,null,null,"Scratch Game",null,null,"Scratch Game",null,null,null,14,92,"Martin Lapidge",24,3438,143.25,43,192,238,519,657,null,"Lew Ashenden",258,"The Kings",471,null,"Stealth Bowlers"]
[null,null,null,null,null,null,null,null,null,null,null,null,null,null,"Lew Ashenden",204,null,"The Kings",379,null,null,15,81,"Paul Simmons",15,2124,141.6,44,188,239,469,617,null,"Steve Emmony",253,"Brothers Grimm",457]
[null,null,null,null,null,null,null,null,null,null,null,null,null,null,"Karl King",200,null,"Just Friends",358,null,null,16,32,"Ethan Taylor",21,2886,137.42857142857142,47,172,224,475,619,null,"Chris Woodward",250,"Hit & Miss",457]
[null,null,null,null,null,null,null,null,null,null,null,null,null,null,"Terry Highton",198,null,"Brothers Grimm",328,null,null,17,31,"Sarah Shellard",24,3254,135.58333333333334,49,181,233,443,591,null,"Martin Cook",249,"Boom",447]
[null,null,null,null,null,null,null,null,null,null,null,null,null,null,"Scratch Series",null,null,"Scratch Series",null,null,null,18,101,"Kevin King",27,3644,134.96296296296296,49,194,242,443,587,null,"Karl King",243,"Chucklers",446]
[null,null,null,null,null,null,null,null,null,null,null,null,null,null,"Terry Highton",543,null,"Just Friends",1062,null,null,19,42,"Chris Johnson",27,3643,134.92592592592592,49,188,239,483,651,null,"Handicap Series",null,"Handicap Series"]
[null,null,null,null,null,null,null,null,null,null,null,null,null,null,"Martin Lapidge",519,null,"Brothers Grimm",873,null,null,20,33,"Owen Campbell",6,802,133.66666666666666,50,212,242,480,570,null,"Donna Smith",659,"Just Friends",1311]
[null,null,null,null,null,null,null,null,null,null,null,null,null,null,"Paul Simmons",469,null,"The Kings",868,null,null,21,51,"Tony Pearce",27,3594,133.11111111111111,51,164,215,433,592,null,"Keith MacFarlane",657,"Hit & Miss",1266]
[null,null,null,null,null,null,null,null,null,null,null,null,null,null,"Handicap Game",null,null,"Handicap Game",null,null,null,22,82,"Liz Lake",18,2378,132.11111111111111,51,167,223,439,607,null,"Martin Lapidge",657,"Brothers Grimm",1263]
[null,null,null,null,null,null,null,null,null,null,null,null,null,null,"Lew Ashenden",258,null,"The Kings",471,null,null,23,41,"Lew Ashenden",27,3498,129.55555555555554,53,204,258,422,596,null,"Terry Highton",654,"Boom",1232]
[null,null,null,null,null,null,null,null,null,null,null,null,null,null,"Karl King",243,null,"Just Friends",441,null,null,24,83,"Donna Smith",21,2701,128.61904761904762,54,182,241,482,659,null,"Martin Cook",654,"Hot Chris Bunz",1225]
[null,null,null,null,null,null,null,null,null,null,null,null,null,null,"Martin Lapidge",238,null,"Boom",429,null,null,25,91,"Karen Davies",15,1875,125,57,159,213,421,562]
[null,null,null,null,null,null,null,null,null,null,null,null,null,null,"Handicap Series",null,null,"Handicap Series",null,null,null,26,63,"Mick King"]
[null,null,null,"Website: www.tenpinleicester.co.uk",null,null,null,null,null,null,null,null,null,null,"Martin Lapidge",657,null,"Just Friends",1311,null,null,27]
[null,null,null,null,null,null,null,null,null,null,null,null,null,null,"Terry Highton",654,null,"Hit & Miss",1157,null,null,28]
[null,null,null,null,null,null,null,null,null,null,null,null,null,null,"Paul Simmons",610,null,"The Kings",1144]
[]
[]
[null,null,"Working area for high scores this week",null,null,null,null,null,null,null,null,null,null,null,null,null,null,null,null,null,null,null,"Working area for high scores in week"]
[null,null,"Copied from teambase",null,null,null,null,null,null,null,null,null,null,null,null,null,null,null,null,null,null,null,"Copied from playbase before updating playstats"]
[null,null,null,null,null,"Points",null,null,null,"High Game",null,"Series",null,null,null,null,null,null,null,null,null,null,null,null,null,null,null,null,"Scratch",null,"Handicap"]
[null,null,null,null,"Played","Won","Lost","Pins","Avge","Scratch","Hcap","Scratch","Hcap",null,null,null,null,null,null,null,null,null,null,null,null,null,null,null,"Scr","Hcap","Scr","Hcap"]
[null,null,9,"Just Friends",1,10,2,1311,437,358,441,1062,1311,null,null,null,null,null,null,null,null,null,92,"Martin Lapidge",3,519,173,46,192,238,519,657]
[null,null,8,"Hit & Miss",1,8,4,1157,385.66666666666669,302,400,863,1157,null,null,null,null,null,null,null,null,null,93,"Terry Highton",3,543,181,37,198,235,543,654]
[null,null,10,"The Kings",1,2,10,1144,381.33333333333331,379,471,868,1144,null,null,null,null,null,null,null,null,null,81,"Paul Simmons",3,469,156.33333333333334,47,159,206,469,610]
[null,null,7,"Brothers Grimm",1,4,8,1065,355,328,392,873,1065,null,null,null,null,null,null,null,null,null,102,"Karl King",3,453,151,43,200,243,453,582]
[null,null,4,"Boom",1,8,4,1057,352.33333333333331,327,429,751,1057,null,null,null,null,null,null,null,null,null,31,"Sarah Shellard",3,428,142.66666666666666,50,156,206,428,578]
[null,null,6,"Mac Too",1,8,4,1048,349.33333333333331,319,387,844,1048,null,null,null,null,null,null,null,null,null,72,"Terry Emmony",3,452,150.66666666666666,39,179,218,452,569]
[null,null,5,"Duo",1,4,8,1041,347,293,373,801,1041,null,null,null,null,null,null,null,null,null,51,"Tony Pearce",3,414,138,51,164,215,414,567]
[null,null,3,"Chucklers",1,4,8,990,330,291,371,750,990,null,null,null,null,null,null,null,null,null,101,"Kevin King",3,415,138.33333333333334,49,179,228,415,562]
[null,null,null,null,null,null,null,null,null,null,null,null,null,null,null,null,null,null,null,null,null,null,41,"Lew Ashenden",3,395,131.66666666666666,54,204,258,395,557]
[null,null,null,null,null,null,null,null,null,null,null,null,null,null,null,null,null,null,null,null,null,null,82,"Liz Lake",3,394,131.33333333333334,51,143,194,394,547]
[null,null,null,null,null,null,null,null,null,null,null,null,null,null,null,null,null,null,null,null,null,null,61,"Diane MacFarlane",3,412,137.33333333333334,40,144,184,412,532]
[null,null,null,null,null,null,null,null,null,null,null,null,null,null,null,null,null,null,null,null,null,null,62,"Keith MacFarlane",3,432,144,28,175,203,432,516]
[null,null,null,null,null,null,null,null,null,null,null,null,null,null,null,null,null,null,null,null,null,null,42,"Chris Johnson",3,356,118.66666666666667,48,139,187,356,500]
[null,null,null,null,null,null,null,null,null,null,null,null,null,null,null,null,null,null,null,null,null,null,71,"Steve Emmony",3,421,140.33333333333334,25,149,174,421,496]
[null,null,null,null,null,null,null,null,null,null,null,null,null,null,null,null,null,null,null,null,null,null,52,"Richard Lester",3,387,129,29,129,158,387,474]
[null,null,null,null,null,null,null,null,null,null,null,null,null,null,null,null,null,null,null,null,null,null,33,"Owen Campbell",3,322,107.33333333333333,30,135,165,322,412]

{"sheet":"high scores","index":6,"n_rows":46,"n_cols":16,"rows_kept":46,"cut":false,"hidden":false,"merged":[[7,2,7,3],[7,5,7,6],[11,2,11,3],[11,5,11,6],[15,2,15,3],[15,5,15,6],[28,2,28,3],[28,4,28,5],[34,2,34,3],[34,4,34,5],[40,2,40,3],[40,4,40,5]]}
[]
[]
[null,null,"High Week",null,null,null,null,null,"Highweek"]
[]
[null,null,"Lew Ashenden",204,null,"The Kings",379,null,{"$f":"C5","v":"Lew Ashenden"},204,{"$f":"C13","v":"Lew Ashenden"},258,{"$f":"C9","v":"Terry Highton"},543,{"$f":"C17","v":"Martin Lapidge"},657]
[null,null,"Karl King",200,null,"Just Friends",358,null,"Karl King",200,"Karl King",243,"Martin Lapidge",519,"Terry Highton",654]
[null,null,"Terry Highton",198,null,"Brothers Grimm",328,null,"Terry Highton",198,"Martin Lapidge",238,"Paul Simmons",469,"Paul Simmons",610]
[null,null,"Scratch Series",null,null,"Scratch Series"]
[null,null,"Terry Highton",543,null,"Just Friends",1062,null,{"$f":"F5","v":"The Kings"},379,{"$f":"F13","v":"The Kings"},471,{"$f":"F9","v":"Just Friends"},1062,{"$f":"F17","v":"Just Friends"},1311]
[null,null,"Martin Lapidge",519,null,"Brothers Grimm",873,null,"Just Friends",358,"Just Friends",441,"Brothers Grimm",873,"Hit & Miss",1157]
[null,null,"Paul Simmons",469,null,"The Kings",868,null,"Brothers Grimm",328,"Boom",429,"The Kings",868,"The Kings",1144]
[null,null,"Handicap Game",null,null,"Handicap Game"]
[null,null,"Lew Ashenden",258,null,"The Kings",471]
[null,null,"Karl King",243,null,"Just Friends",441]
[null,null,"Martin Lapidge",238,null,"Boom",429]
[null,null,"Handicap Series",null,null,"Handicap Series"]
[null,null,"Martin Lapidge",657,null,"Just Friends",1311]
[null,null,"Terry Highton",654,null,"Hit & Miss",1157]
[null,null,"Paul Simmons",610,null,"The Kings",1144]
[]
[]
[null,null,"High Season",null,null,null,null,null,"highest"]
[]
[null,null,"Steve Emmony",227,"Mac Too",383,null,null,{"$f":"C24","v":"Steve Emmony"},{"$f":"D24","v":227},{"$f":"C36","v":"Lew Ashenden"},{"$f":"D36","v":258},{"$f":"C30","v":"Steve Emmony"},{"$f":"D30","v":571},{"$f":"C42","v":"Donna Smith"},{"$f":"D42","v":659}]
[null,null,"Owen Campbell",212,"The Kings",379,null,null,{"$f":"C25","v":"Owen Campbell"},212,{"$f":"C37","v":"Steve Emmony"},253,{"$f":"C31","v":"Keith MacFarlane"},567,{"$f":"C43","v":"Keith MacFarlane"},657]
[null,null,"Keith MacFarlane",207,"Brothers Grimm",368,null,null,"Keith MacFarlane",207,"Chris Woodward",250,"Terry Highton",543,"Martin Lapidge",657]
[null,null,"Chris Woodward",204,"Chucklers",368,null,null,"Chris Woodward",204,"Martin Cook",249,"Diane MacFarlane",520,"Terry Highton",654]
[null,null,"Lew Ashenden",204,"Just Friends",358,null,null,"Lew Ashenden",204,"Karl King",243,"Martin Lapidge",519,"Martin Cook",654]
[null,null,"Scratch Series",null,"Scratch Series"]
[null,null,"Steve Emmony",571,"Just Friends",1062,null,null,{"$f":"E24","v":"Mac Too"},{"$f":"F24","v":383},{"$f":"E36","v":"The Kings"},{"$f":"F36","v":471},{"$f":"E30","v":"Just Friends"},{"$f":"F30","v":1062},{"$f":"E42","v":"Just Friends"},{"$f":"F42","v":1311}]
[null,null,"Keith MacFarlane",567,"Brothers Grimm",1006,null,null,{"$f":"E25","v":"The Kings"},379,{"$f":"E37","v":"Brothers Grimm"},457,{"$f":"E31","v":"Brothers Grimm"},1006,{"$f":"E43","v":"Hit & Miss"},1266]
[null,null,"Terry Highton",543,"Mac Too",1004,null,null,"Brothers Grimm",368,"Hit & Miss",457,"Mac Too",1004,"Brothers Grimm",1263]
[null,null,"Diane MacFarlane",520,"Hot Chris Bunz",958,null,null,"Chucklers",368,"Boom",447,"Hot Chris Bunz",958,"Boom",1232]
[null,null,"Martin Lapidge",519,"Hit & Miss",921,null,null,"Just Friends",358,"Chucklers",446,"Hit & Miss",921,"Hot Chris Bunz",1225]
[null,null,"Handicap Game",null,"Handicap Game"]
[null,null,"Lew Ashenden",258,"The Kings",471]
[null,null,"Steve Emmony",253,"Brothers Grimm",457]
[null,null,"Chris Woodward",250,"Hit & Miss",457]
[null,null,"Martin Cook",249,"Boom",447,null,null,"Best"]
[null,null,"Karl King",243,"Chucklers",446,null,null,"Terry Highton",543]
[null,null,"Handicap Series",null,"Handicap Series",null,null,null,"Graham Lapidge",519]
[null,null,"Donna Smith",659,"Just Friends",1311,null,null,"Lew Ashenden",null,204]
[null,null,"Keith MacFarlane",657,"Hit & Miss",1266,null,null,"Karl King",null,200]
[null,null,"Martin Lapidge",657,"Brothers Grimm",1263]
[null,null,"Terry Highton",654,"Boom",1232]
[null,null,"Martin Cook",654,"Hot Chris Bunz",1225]

{"sheet":"Scratch Leagues","index":7,"n_rows":41,"n_cols":14,"rows_kept":41,"cut":false,"hidden":false,"merged":[[6,2,6,3],[4,2,4,7],[4,8,4,13],[5,2,5,4],[5,5,5,7],[5,8,5,10],[5,11,5,13]]}
[]
[]
[null,null,"Monday Doubles League - Summer 2013",null,null,null,"Scratch High Scores League",null,null,null,"After Week 10, 15 July "]
[]
[null,null,"High Game",null,null,null,null,null,"High Series"]
[null,null,"175+",null,null,"200+",null,null,"475+",null,null,"500+"]
[null,null,null,null,"Best",null,null,"Best",null,null,"Best",null,null,"Best"]
[null,null,"Keith MacFarlane",5,191,"Keith MacFarlane",2,207,"Steve Emmony",4,499,"Steve Emmony",2,571]
[null,null,"Steve Emmony",4,196,"Steve Emmony",1,227,"Richard Lester",4,487,"Keith MacFarlane",2,567]
[null,null,"Richard Lester",4,194,"Owen Campbell",1,212,"Keith MacFarlane",2,499,"Terry Highton",2,543]
[null,null,"Terry Highton",3,198,"Chris Woodward",1,204,"Terry Emmony",2,493,"Diane MacFarlane",2,520]
[null,null,"Kevin King",3,194,"Lew Ashenden",1,204,"Martin Lapidge",1,496,"Richard Lester",2,515]
[null,null,"Martin Lapidge",3,192,"Karl King",1,200,"Nathon Ferrie",1,488,"Martin Lapidge",1,519]
[null,null,"Diane MacFarlane",3,191,null,null,null,"Chris Woodward",1,486,"Chris Woodward",1,505]
[null,null,"Martin Cook",2,199,null,null,null,"Chris Johnson",1,483,"Martin Cook",1,504]
[null,null,"Terry Emmony",2,189,null,null,null,"Carl Briggs",1,482]
[null,null,"Chris Woodward",2,188,null,null,null,"Donna Smith",1,482]
[null,null,"Donna Smith",2,182,null,null,null,"Owen Campbell",1,480]
[null,null,"Nathon Ferrie",1,197,null,null,null,"Ethan Taylor",1,475]
[null,null,"Chris Johnson",1,188]
[null,null,"Paul Simmons",1,188]
[null,null,"Bunz Hughes",1,184]
[null,null,"Sarah Shellard",1,181]
[null,null,"Carl Briggs",1,179]
[null,null,"Karl King",1,175]
[]
[null,null,"Bunz Hughes"]
[null,null,"Gary Wileman"]
[null,null,"Sarah Shellard"]
[null,null,"Ethan Taylor"]
[null,null,"Owen Campbell"]
[null,null,"Lew Ashenden"]
[null,null,"Chris Johnson"]
[null,null,"Tony Pearce"]
[null,null,"Mick King"]
[null,null,"Terry Emmony"]
[null,null,"Martin Cook"]
[null,null,"Paul Simmons"]
[null,null,"Liz Lake"]
[null,null,"Karen Davies"]
[null,null,null,{"$f":"SUM(D8:D40)","v":40}]

{"sheet":"Certificates","index":8,"n_rows":33,"n_cols":28,"rows_kept":33,"cut":false,"hidden":false,"merged":[]}
[null,null,null,null,null,null,null,null,null,null,null,null,null,"count2",16]
[]
[]
[null,null,1,"League Champions","RTFB","Gary Wileman","Tony King","Carl Briggs",null,405,477,1068,1284,null,null,null,null,null,"Hollywood"]
[null,null,2,"League Runners Up","Brothers Grimm","Steve Emmony","Terry Emmony",null,null,405,466,1068,1257,null,null,null,null,null,"Bowl",null,"Final Position:",{"$f":"VLOOKUP(count2,league,2)","v":"Sixteenth"}]
[null,null,3,"League Third place","Mac Too +1","Diane MacFarlane","Mick King","Keith MacFarlane",null,399,485,1062,1266,null,null,null,null,null,"Leicester",null,{"$f":"VLOOKUP(count2,league,3)","v":"Pin Pals"}]
[null,null,4,"Fourth","The Young Ones","Tim Hill","Adam Holland","Nicola Rye Holland",null,387,464,986,1220]
[null,null,5,"Fifth","X-Men","Paul Hurst","Merv Farrow","Mick Freeborn",null,392,475,1043,1292,null,null,null,null,null,"Monday",null,null,{"$f":"VLOOKUP(count2,league,4)","v":"Berenice Davies"}]
[null,null,6,"Sixth","Duo","Tony Pearce","Richard Lester",null,null,367,451,984,1236,null,null,null,null,null,"Handicap",null,null,{"$f":"VLOOKUP(count2,league,5)","v":"Anita Highton"}]
[null,null,7,"Seventh","Dominoes","Rose Barton","Alan Barton","Matt Barton","Jason Kettle",414,483,999,1207,null,null,null,null,null,"Doubles",null,null,{"$f":"IF(VLOOKUP(count2,league,6)=\"\",\"\",VLOOKUP(count2,league,6))","v":"Karen Davies"}]
[null,null,8,"Eighth","The Owls","Mary Grayson","Brian Grayson",null,null,336,426,933,1212,null,null,null,null,null,"League",null,null,{"$f":"IF(VLOOKUP(count2,league,7)=\"\",\"\",VLOOKUP(count2,league,7))","v":""}]
[null,null,9,"Ninth","Turkeys","Martin Cook","Harry Hargreaves",null,null,437,502,1141,1336]
[null,null,10,"Tenth","Whip & Bake","Carrie Bryer","Steve Bryer","John Bryer",null,378,460,995,1238,null,null,null,null,null,"Winter"]
[null,null,11,"Eleventh","Glitter Girls","Barbara Lewis","Kim Stone","Julie Pinder",null,368,475,933,1284,null,null,null,null,null,"2010/2011"]
[null,null,12,"Twelth","Lightning Strikes","Mike Davies","Terry Highton","Graham Lewis","Phil Highton",415,479,1141,1333,null,null,null,null,null,"    16 teams over 31 weeks"]
[null,null,13,"Thirteenth","Hit & Miss","Mandy King","Paul Simmons","Liz Lake","Donna Smith",380,464,967,1242,null,null,null,null,null,"13 Sep 2010 - 23 May 2011"]
[null,null,14,"Fourteenth","SOS","Dale Cousins","Susi Cousins","Steve Cousins","Chris Cousins",400,474,1002,1224]
[null,null,15,"Fifteenth","I Can't Believe It's Not Gutter","Matt Lowe","Rich Tewkesbury","John Glover","Joe McConville",357,474,914,1265]
[null,null,16,"Sixteenth","Pin Pals","Berenice Davies","Anita Highton","Karen Davies",null,337,438,905,1214,null,null,null,null,null,null,null,null,null,null,null,null,"Team High Scores: "]
[null,null,null,null,null,null,null,null,null,null,null,null,null,null,null,null,null,null,null,null,null,null,null,null,null,"Game:  ","Scratch",{"$f":"VLOOKUP(count2,league,8)","v":337}]
[null,null,null,null,null,null,null,null,null,null,null,null,null,null,null,null,null,null,"Hollywood",null,null,null,null,null,null,null,"Handicap",{"$f":"VLOOKUP(count2,league,9)","v":438}]
[null,null,null,null,null,null,null,null,null,null,null,null,null,null,null,null,null,null,"Bowl",null,"Final Position:",{"$f":"VLOOKUP(count2,league,2)","v":"Sixteenth"},null,null,null,"Series:  ","Scratch",{"$f":"VLOOKUP(count2,league,10)","v":905}]
[null,null,null,null,null,null,null,null,null,null,null,null,null,null,null,null,null,null,"Leicester",null,{"$f":"VLOOKUP(count2,league,3)","v":"Pin Pals"},null,null,null,null,null,"Handicap",{"$f":"VLOOKUP(count2,league,11)","v":1214}]
[]
[null,null,null,null,null,null,null,null,null,null,null,null,null,null,null,null,null,null,"Monday",null,null,{"$f":"VLOOKUP(count2,league,4)","v":"Berenice Davies"}]
[null,null,null,null,null,null,null,null,null,null,null,null,null,null,null,null,null,null,"Handicap",null,null,{"$f":"VLOOKUP(count2,league,5)","v":"Anita Highton"}]
[null,null,null,null,null,null,null,null,null,null,null,null,null,null,null,null,null,null,"Doubles",null,null,{"$f":"IF(VLOOKUP(count2,league,6)=\"\",\"\",VLOOKUP(count2,league,6))","v":"Karen Davies"}]
[null,null,null,null,null,null,null,null,null,null,null,null,null,null,null,null,null,null,"League",null,null,{"$f":"IF(VLOOKUP(count2,league,7)=\"\",\"\",VLOOKUP(count2,league,7))","v":""}]
[]
[null,null,null,null,null,null,null,null,null,null,null,null,null,null,null,null,null,null,"Winter"]
[null,null,null,null,null,null,null,null,null,null,null,null,null,null,null,null,null,null,"2010/2011"]
[null,null,null,null,null,null,null,null,null,null,null,null,null,null,null,null,null,null,"    16 teams over 31 weeks"]
[null,null,null,null,null,null,null,null,null,null,null,null,null,null,null,null,null,null,"13 Sep 2010 - 23 May 2011"]

{"sheet":"Sheet2","index":9,"n_rows":0,"n_cols":0,"rows_kept":0,"cut":false,"hidden":false,"merged":[]}